{"text_format":"1","workbook":"xlsx","n_sheets":2,"sheets":["Formulario","Aportes 2026"],"not_rendered":{"charts":0,"images":0,"macros":1,"external_links":0,"defined_names":13,"comments":0,"pivot_tables":0},"unopened":[],"bounds":{"document_bytes":16777216,"sheet_cells":100000,"rows_first":2000,"rows_last":500,"rows_between":2000,"halvings":0,"cell_chars":16384,"cell_head_chars":4096},"cells_cut":0,"cells_raw":0,"read":"whole","date_system":"1900"}

{"sheet":"Formulario","index":0,"n_rows":104,"n_cols":16,"rows_kept":104,"cut":false,"hidden":false,"merged":[[0,1,0,7],[48,2,48,5],[1,1,1,7],[24,1,24,7],[26,2,26,5],[37,2,37,5],[3,1,3,2],[5,1,5,2],[7,1,7,2],[18,1,18,2]]}
[null,"Cotiza tu plan de EPS Individual 2026"]
[null,"Aportes vigentes para la venta desde el 01/08/2026 al 31/07/2027",null,null,null,null,null,null,null,"Confirmar",null,"Edad ","Parentesco","Plan","Modalidad de Pago"]
[]
[null,"¿Qué tipo de plan EPS has tenido?",null,1,null,null,null,null,null,"Plan Regular",1,"0 años","Cónyuge","Base","Contado (1 Cuota)"]
[null,null,null,null,null,null,null,null,null,"Plan Padres",2,"1 año","Conviviente","Plus","Aportes 12 cuotas Débito Automático (TCEA 4%)"]
[null,"Edad del titular:",null,43,null,null,null,null,null,"Plan Jubilados",3,"2 años","Hijo","Premium","Aportes 12 cuotas Cuponera (TCEA 17.5%)"]
[null,null,null,null,null,null,null,null,null,"Ninguno",4,"3 años","Hija","Todos","Todos"]
[null,"¿Deseas incluir a tu familia?",null,2,null,null,null,null,null,null,5,"4 años"]
[null,null,null,null,null,null,null,null,null,null,6,"5 años"]
[null,null,null,"Parentesco",null,{"$f":"+IFERROR(VLOOKUP(D6,K:L,2,0),\"\")","v":"42 años"},null,null,null,{"$f":"+F10","v":"42 años"},7,"6 años"]
[null,null,"Dependiente 1:  ",null,"Edad:",null,null,null,null,{"$f":"IF(D11<>\"\",IF(OR(D11=\"Hijo\",D11=\"Hija\"),D11&\" \"&F11,F11),\"\")","v":""},8,"7 años",null,{"$f":"+IF(D11<>\"\",1,0)","v":0},{"$f":"+IF(F11<>\"\",1,0)","v":0},{"$f":"+IF(O11=N11,0,1)","v":0}]
[null,null,"Dependiente 2:  ",null,"Edad:",null,null,null,null,{"$f":"IF(D12<>\"\",IF(OR(D12=\"Hijo\",D12=\"Hija\"),D12&\" \"&F12,F12),\"\")","v":""},9,"8 años",null,{"$f":"+IF(D12<>\"\",1,0)","v":0},{"$f":"+IF(F12<>\"\",1,0)","v":0},{"$f":"+IF(O12=N12,0,1)","v":0}]
[null,null,"Dependiente 3:  ",null,"Edad:",null,null,null,null,"",10,"9 años",null,0,0,0]
[null,null,"Dependiente 4:  ",null,"Edad:",null,null,null,null,"",11,"10 años",null,0,0,0]
[null,null,"Dependiente 5:  ",null,"Edad:",null,null,null,null,"",12,"11 años",null,0,0,0]
[null,null,"Dependiente 6:  ",null,"Edad:",null,null,null,null,"",13,"12 años",null,0,0,0]
[null,null,null,null,null,null,null,null,null,null,14,"13 años",null,null,"ERRORES",{"$f":"SUM(P11:P16)","v":0}]
[null,null,null,null,null,null,null,null,null,"Incluir",15,"14 años"]
[null,"Plan elegido",null,4,null,null,null,null,null,"SI",16,"15 años",null,"Base Senior"]
[null,null,null,null,null,null,null,null,null,"NO",17,"16 años",null,"Plus Senior"]
[null,null,"Modalidad de Pago",4,null,null,null,null,null,null,18,"17 años",null,"Todos"]
[null,null,null,null,null,null,null,null,null,null,19,"18 años"]
[null,null,null,null,null,null,null,null,null,null,20,"19 años"]
[null,null,null,null,null,null,null,null,null,null,21,"20 años"]
[null,"Resultado de la cotización",null,null,null,null,null,null,null,null,22,"21 años"]
[null,null,null,null,null,null,null,null,null,null,23,"22 años"]
[null,null,"Aporte Anual - Pago al contado (Cuponera o Débito Automático)",null,null,null,null,null,null,null,24,"23 años"]
[null,null,"Edad ","Base","Plus","Premium",null,null,null,null,25,"24 años"]
[null,null,"42 años",6347,7483.9999999999991,11223,null,null,null,null,26,"25 años"]
[null,null,null,"","","",null,null,null,null,27,"26 años"]
[null,null,null,"","","",null,null,null,null,28,"27 años"]
[null,null,null,"","","",null,null,null,null,29,"28 años"]
[null,null,null,"","","",null,null,null,null,30,"29 años"]
[null,null,null,"","","",null,null,null,null,31,"30 años"]
[null,null,null,"","","",null,null,null,null,32,"31 años"]
[null,null,"Total_Pagar",{"$f":"SUM(D29:D35)","v":6347},{"$f":"SUM(E29:E35)","v":7483.9999999999991},{"$f":"SUM(F29:F35)","v":11223},null,null,null,null,33,"32 años"]
[null,null,null,null,null,null,null,null,null,null,34,"33 años"]
[null,null,"Aportes Mensuales (12 cuotas) -  Débito Automático (TCEA 4%)",null,null,null,null,null,null,null,35,"34 años"]
[null,null,"Edad ","Base","Plus","Premium",null,null,null,null,36,"35 años"]
[null,null,"42 años",540.23908633802125,637.0173817793841,955.2707209660648,null,null,null,null,37,"36 años"]
[null,null,null,"","","",null,null,null,null,38,"37 años"]
[null,null,null,"","",{"$f":"IFERROR(VLOOKUP(C42,'Aportes 2026'!B:U,11,0),\"\")","v":""},null,null,null,null,39,"38 años"]
[null,null,null,"","",{"$f":"IFERROR(VLOOKUP(C43,'Aportes 2026'!B:U,11,0),\"\")","v":""},null,null,null,null,40,"39 años"]
[null,null,null,"","",{"$f":"IFERROR(VLOOKUP(C44,'Aportes 2026'!B:U,11,0),\"\")","v":""},null,null,null,null,41,"40 años"]
[null,null,null,"","",{"$f":"IFERROR(VLOOKUP(C45,'Aportes 2026'!B:U,11,0),\"\")","v":""},null,null,null,null,42,"41 años"]
[null,null,null,"","",{"$f":"IFERROR(VLOOKUP(C46,'Aportes 2026'!B:U,11,0),\"\")","v":""},null,null,null,null,43,"42 años"]
[null,null,"Total_Pagar",{"$f":"SUM(D40:D46)","v":540.23908633802125},{"$f":"SUM(E40:E46)","v":637.0173817793841},{"$f":"SUM(F40:F46)","v":955.2707209660648},null,null,null,null,44,"43 años"]
[null,null,null,null,null,null,null,null,null,null,45,"44 años"]
[null,null,"Aportes Mensuales (12 cuotas) - Cuponera (TCEA 17.5%)",null,null,null,null,null,null,null,46,"45 años"]
[null,null,"Edad ","Base","Plus","Premium",null,null,null,null,47,"46 años"]
[null,null,"42 años",575.90414458811665,679.07146968606662,1018.33499522805,null,null,null,null,48,"47 años"]
[null,null,null,"","","",null,null,null,null,49,"48 años"]
[null,null,null,"","","",null,null,null,null,50,"49 años"]
[null,null,null,"","","",null,null,null,null,51,"50 años"]
[null,null,null,"","","",null,null,null,null,52,"51 años"]
[null,null,null,"","","",null,null,null,null,53,"52 años"]
[null,null,null,"","","",null,null,null,null,54,"53 años"]
[null,null,"Total_Pagar",{"$f":"SUM(D51:D57)","v":575.90414458811665},679.07146968606662,1018.33499522805,null,null,null,null,55,"54 años"]
[null,null,null,null,null,null,null,null,null,null,56,"55 años"]
[null,null,null,null,null,null,null,null,null,null,57,"56 años"]
{"$rows_left_out":45}
{"sheet":"Aportes 2026","index":1,"n_rows":307,"n_cols":21,"rows_kept":307,"cut":false,"hidden":true,"merged":[[0,1,0,20],[2,1,2,6],[2,8,2,13],[2,15,2,20]]}
[null,"APORTES EPS INDIVIDUAL - 2026"]
[null,"PASS MACRO","Doge2729",null,null,null,null,null,null,8.51172343371705E-2,null,null,null,null,null,null,9.0842417251572327E-2]
[null,"Aporte Pago al Contado ",null,null,null,null,null,null,"Aportes 12 cuotas Débito Automático (TCEA 4%)",null,null,null,null,null,null,"Aportes 12 cuotas Cuponera (TCEA 17.5%)"]
[null,"Edad ","BASE","PLUS","PREMIUM","BASE SENIOR ","PLUS SENIOR",null,"Edad ","BASE","PLUS","PREMIUM","BASE SENIOR ","PLUS SENIOR",null,"Edad ","BASE","PLUS","PREMIUM","BASE SENIOR ","PLUS SENIOR"]
[null,"Hijo 0 años",4052,4426,5644,3444,3763,null,"Hijo 0 años",344.89503353421492,376.7288791763167,480.40167059899028,293.14375505721529,320.29615281077258,null,"Hijo 0 años",367.66402928486667,401.59945548243331,512.11643170873344,312.4962776054,341.44119995038329]
[null,"Hijo 1 año",4052,4426,5644,3444,3763,null,"Hijo 1 año",344.89503353421492,376.7288791763167,480.40167059899028,293.14375505721529,320.29615281077258,null,"Hijo 1 año",367.66402928486667,401.59945548243331,512.11643170873344,312.4962776054,341.44119995038329]
[null,"Hijo 2 años",4052,4426,5644,3444,3763,null,"Hijo 2 años",344.89503353421492,376.7288791763167,480.40167059899028,293.14375505721529,320.29615281077258,null,"Hijo 2 años",367.66402928486667,401.59945548243331,512.11643170873344,312.4962776054,341.44119995038329]
[null,"Hijo 3 años",4052,4426,5644,3444,3763,null,"Hijo 3 años",344.89503353421492,376.7288791763167,480.40167059899028,293.14375505721529,320.29615281077258,null,"Hijo 3 años",367.66402928486667,401.59945548243331,512.11643170873344,312.4962776054,341.44119995038329]
[null,"Hijo 4 años",4052,4426,5644,3444,3763,null,"Hijo 4 años",344.89503353421492,376.7288791763167,480.40167059899028,293.14375505721529,320.29615281077258,null,"Hijo 4 años",367.66402928486667,401.59945548243331,512.11643170873344,312.4962776054,341.44119995038329]
[null,"Hijo 5 años",4052,4426,5644,3444,3763,null,"Hijo 5 años",344.89503353421492,376.7288791763167,480.40167059899028,293.14375505721529,320.29615281077258,null,"Hijo 5 años",367.66402928486667,401.59945548243331,512.11643170873344,312.4962776054,341.44119995038329]
[null,"Hijo 6 años",4052,4426,5644,3444,3763,null,"Hijo 6 años",344.89503353421492,376.7288791763167,480.40167059899028,293.14375505721529,320.29615281077258,null,"Hijo 6 años",367.66402928486667,401.59945548243331,512.11643170873344,312.4962776054,341.44119995038329]
[null,"Hijo 7 años",4052,4426,5644,3444,3763,null,"Hijo 7 años",344.89503353421492,376.7288791763167,480.40167059899028,293.14375505721529,320.29615281077258,null,"Hijo 7 años",367.66402928486667,401.59945548243331,512.11643170873344,312.4962776054,341.44119995038329]
[null,"Hijo 8 años",4052,4426,5644,3444,3763,null,"Hijo 8 años",344.89503353421492,376.7288791763167,480.40167059899028,293.14375505721529,320.29615281077258,null,"Hijo 8 años",367.66402928486667,401.59945548243331,512.11643170873344,312.4962776054,341.44119995038329]
[null,"Hijo 9 años",4052,4426,5644,3444,3763,null,"Hijo 9 años",344.89503353421492,376.7288791763167,480.40167059899028,293.14375505721529,320.29615281077258,null,"Hijo 9 años",367.66402928486667,401.59945548243331,512.11643170873344,312.4962776054,341.44119995038329]
[null,"Hijo 10 años",4052,4426,5644,3444,3763,null,"Hijo 10 años",344.89503353421492,376.7288791763167,480.40167059899028,293.14375505721529,320.29615281077258,null,"Hijo 10 años",367.66402928486667,401.59945548243331,512.11643170873344,312.4962776054,341.44119995038329]
[null,"Hijo 11 años",4052,4426,5644,3444,3763,null,"Hijo 11 años",344.89503353421492,376.7288791763167,480.40167059899028,293.14375505721529,320.29615281077258,null,"Hijo 11 años",367.66402928486667,401.59945548243331,512.11643170873344,312.4962776054,341.44119995038329]
[null,"Hijo 12 años",4052,4426,5644,3444,3763,null,"Hijo 12 años",344.89503353421492,376.7288791763167,480.40167059899028,293.14375505721529,320.29615281077258,null,"Hijo 12 años",367.66402928486667,401.59945548243331,512.11643170873344,312.4962776054,341.44119995038329]
[null,"Hijo 13 años",4052,4426,5644,3444,3763,null,"Hijo 13 años",344.89503353421492,376.7288791763167,480.40167059899028,293.14375505721529,320.29615281077258,null,"Hijo 13 años",367.66402928486667,401.59945548243331,512.11643170873344,312.4962776054,341.44119995038329]
[null,"Hijo 14 años",4052,4426,5644,3444,3763,null,"Hijo 14 años",344.89503353421492,376.7288791763167,480.40167059899028,293.14375505721529,320.29615281077258,null,"Hijo 14 años",367.66402928486667,401.59945548243331,512.11643170873344,312.4962776054,341.44119995038329]
[null,"Hijo 15 años",4052,4426,5644,3444,3763,null,"Hijo 15 años",344.89503353421492,376.7288791763167,480.40167059899028,293.14375505721529,320.29615281077258,null,"Hijo 15 años",367.66402928486667,401.59945548243331,512.11643170873344,312.4962776054,341.44119995038329]
[null,"Hijo 16 años",4052,4426,5644,3444,3763,null,"Hijo 16 años",344.89503353421492,376.7288791763167,480.40167059899028,293.14375505721529,320.29615281077258,null,"Hijo 16 años",367.66402928486667,401.59945548243331,512.11643170873344,312.4962776054,341.44119995038329]
[null,"Hijo 17 años",4052,4426,5644,3444,3763,null,"Hijo 17 años",344.89503353421492,376.7288791763167,480.40167059899028,293.14375505721529,320.29615281077258,null,"Hijo 17 años",367.66402928486667,401.59945548243331,512.11643170873344,312.4962776054,341.44119995038329]
[null,"Hijo 18 años",4275,4652,5664.9999999999991,3633,3954,null,"Hijo 18 años",363.87617679140402,395.96537413651731,482.18913252007093,309.2309123469405,336.55354456917217,null,"Hijo 18 años",387.89825399624999,422.10588949486669,514.02189681608331,329.64546357155001,358.77185878389997]
[null,"Hijo 19 años",4275,4652,5664.9999999999991,3633,3954,null,"Hijo 19 años",363.87617679140402,395.96537413651731,482.18913252007093,309.2309123469405,336.55354456917217,null,"Hijo 19 años",387.89825399624999,422.10588949486669,514.02189681608331,329.64546357155001,358.77185878389997]
[null,"Hijo 20 años",4275,4652,5664.9999999999991,3633,3954,null,"Hijo 20 años",363.87617679140402,395.96537413651731,482.18913252007093,309.2309123469405,336.55354456917217,null,"Hijo 20 años",387.89825399624999,422.10588949486669,514.02189681608331,329.64546357155001,358.77185878389997]
[null,"Hijo 21 años",4275,4652,5664.9999999999991,3633,3954,null,"Hijo 21 años",363.87617679140402,395.96537413651731,482.18913252007093,309.2309123469405,336.55354456917217,null,"Hijo 21 años",387.89825399624999,422.10588949486669,514.02189681608331,329.64546357155001,358.77185878389997]
[null,"Hijo 22 años",4275,4652,5664.9999999999991,3633,3954,null,"Hijo 22 años",363.87617679140402,395.96537413651731,482.18913252007093,309.2309123469405,336.55354456917217,null,"Hijo 22 años",387.89825399624999,422.10588949486669,514.02189681608331,329.64546357155001,358.77185878389997]
[null,"Hijo 23 años",4275,4652,5664.9999999999991,3633,3954,null,"Hijo 23 años",363.87617679140402,395.96537413651731,482.18913252007093,309.2309123469405,336.55354456917217,null,"Hijo 23 años",387.89825399624999,422.10588949486669,514.02189681608331,329.64546357155001,358.77185878389997]
[null,"Hijo 24 años",4275,4652,5664.9999999999991,3633,3954,null,"Hijo 24 años",363.87617679140402,395.96537413651731,482.18913252007093,309.2309123469405,336.55354456917217,null,"Hijo 24 años",387.89825399624999,422.10588949486669,514.02189681608331,329.64546357155001,358.77185878389997]
[null,"Hijo 25 años",4275,4652,5664.9999999999991,3633,3954,null,"Hijo 25 años",363.87617679140402,395.96537413651731,482.18913252007093,309.2309123469405,336.55354456917217,null,"Hijo 25 años",387.89825399624999,422.10588949486669,514.02189681608331,329.64546357155001,358.77185878389997]
[null,"Hijo 26 años",4444,5005.9999999999991,6281,3777,4256.0000000000009,null,"Hijo 26 años",378.26098939438577,426.09687509187552,534.62134887176796,321.48779409149307,362.25894933899781,null,"Hijo 26 años",403.23271128873341,454.22658701876668,569.91553996501671,342.71151002195001,386.17426175626679]
[null,"Hijo 27 años",4925,5630.0000000000009,6881,4186,4785,null,"Hijo 27 años",419.20237911056478,479.21002931827007,585.69168947407036,356.30074293539582,407.28596630336091,null,"Hijo 27 años",446.87693589041658,510.84612163716668,624.35740017501666,379.82271139843328,434.17383517475008]
[null,"Hijo 28 años",4941.9999999999991,5771,7174,4200,4906,null,"Hijo 28 años",420.64937209429661,491.21155935981102,610.63103913486123,357.49238421611619,417.58515165815862,null,"Hijo 28 años",448.41945526303329,523.63995878651667,650.94317524423343,381.09302147000011,445.15294365043337]
[null,"Hijo 29 años",4959.0000000000009,5921,7596,4215,5033.0000000000009,null,"Hijo 29 años",422.09636507802873,503.97914451038662,646.55051202514721,358.7691427311737,428.39504041897919,null,"Hijo 29 años",449.96197463565011,537.25042383901678,689.23395025860009,382.45406797524998,456.67647072821671]
[null,"Hijo 30 años",5049.9999999999991,5971,7937,4292,5076,null,"Hijo 30 años",429.84203340271102,508.23500622724521,675.5754889341224,365.32316977513591,432.05508149547762,null,"Hijo 30 años",458.21899010083342,541.7872455231834,720.1750741446167,389.4407733688667,460.57813737660001]
[null,"Hijo 31 años",5049.9999999999991,6063,8290,4292,5154,null,"Hijo 31 años",429.84203340271102,516.06579178626487,705.62187265514353,365.32316977513591,438.69422577377691,null,"Hijo 31 años",458.21899010083342,550.13499742204999,752.20503523483342,389.4407733688667,467.6555792039]
[null,"Hijo 32 años",5091.9999999999991,6086,8665,4327,5172.9999999999991,null,"Hijo 32 años",433.41695724487221,518.02348817601967,737.5408355315825,368.30227297693682,440.311453226183,null,"Hijo 32 años",462.02992031553327,552.22193539676675,786.23119786608345,392.61654854778328,469.37957144388332]
[null,"Hijo 33 años",5123.9999999999991,6144.0000000000009,8919,4355,5222.0000000000009,null,"Hijo 33 años",436.14070874366161,522.96028776757566,759.16061305322387,370.68555553837763,444.48219770870452,null,"Hijo 33 años",464.93348619339997,557.48464855040004,809.27825202165002,395.15716869091671,473.82565669436678]
[null,"Hijo 34 años",5154,6183.0000000000009,9099,4381,5256,null,"Hijo 34 años",438.69422577377691,526.27985990672539,774.48171523391443,372.898603631144,447.37618367616818,null,"Hijo 34 años",467.6555792039,561.02336946405001,825.6108100846501,397.51631596668329,476.91069543959998]
[null,"Hijo 35 años",5185.0000000000009,6304.9999999999991,9148.9999999999982,4407,5359,null,"Hijo 35 años",441.33286003822923,536.66416249586007,778.7375769507729,375.11165172391043,456.14325881289682,null,"Hijo 35 años",470.46840864808343,572.09321437341669,830.14763176881661,399.87546324245011,486.25654810898328]
[null,"Hijo 36 años",5261.9999999999991,6313,9335,4472.0000000000009,5366.0000000000009,null,"Hijo 36 años",447.88688708219121,537.34510037055747,794.56938253748672,380.64427195582658,456.73907945325709,null,"Hijo 36 años",477.45511404170003,572.81910584288346,847.02460843391668,405.77333143186672,486.89170314476672]
[null,"Hijo 37 años",5261.9999999999991,6328,9425,4472.0000000000009,5379,null,"Hijo 37 años",447.88688708219121,538.62185888561498,802.22993362783211,380.64427195582658,457.84560349964022,null,"Hijo 37 años",477.45511404170003,574.18015234813345,855.19088746541672,405.77333143186672,488.07127678264999]
[null,"Hijo 38 años",5318.0000000000009,6351,9608,4520,5398,null,"Hijo 38 años",452.65345220507282,540.5795552753699,817.80638751153435,384.72989920401068,459.46283095204637,null,"Hijo 38 años",482.53635432796671,576.26709032285009,871.79565482946668,410.12868024866668,489.79526902263342]
[null,"Hijo 39 años",5606,6417,9795.0000000000018,4764,5453.9999999999991,null,"Hijo 39 años",477.16721569417791,546.19729274162319,833.72331033258536,405.49850438228032,464.22939607492788,null,"Hijo 39 años",508.66844722876669,582.25569494595004,888.76336792825009,432.26837006739999,494.87650930889998]
[null,"Hijo 40 años",5883,6477,10316,5000,5506,null,"Hijo 40 años",500.74468960557408,551.30432680185345,878.06938942225111,425.58617168585249,468.65549226046079,null,"Hijo 40 años",533.80243935905003,587.69988096694999,936.03704987726667,453.68216841666668,499.59480386043327]
[null,"Hijo 41 años",6170.9999999999991,6962,10658,5245,5918,null,"Hijo 41 años",525.25845309467911,592.58618545538116,907.17948356556326,446.43989409845932,503.72379280737499,null,"Hijo 41 años",559.93453225985002,631.70705130336671,967.06891019696673,475.91259466908332,536.97821453796678]
[null,"Hijo 42 años",6347,7483.9999999999991,11223,5395,6361,null,"Hijo 42 años",540.23908633802125,637.0173817793841,955.2707209660648,459.20747924903492,541.43072761874168,null,"Hijo 42 años",575.90414458811665,679.07146968606662,1018.33499522805,489.52305972158342,577.17445465968342]
[null,"Hijo 43 años",6523,8083,11576,5543.9999999999991,6870,null,"Hijo 43 años",555.21971958136317,688.0026051473493,985.31710468708582,471.88994716527333,584.75539989636138,null,"Hijo 43 años",591.8737569163834,733.42259346238347,1050.3649563182671,503.04278834040002,623.35929940450001]
[null,"Hijo 44 años",6727,8415,12015,5717,7153,null,"Hijo 44 años",572.58363538614606,716.26152694728978,1022.683570561104,486.61522870560378,608.84357721378069,null,"Hijo 44 años",610.38398938778346,763.54708944525009,1090.1982507052501,518.74019136761672,649.03771013688345]
[null,"Hijo 45 años",6990,8746,12349,5941,7434,null,"Hijo 45 años",594.96946801682191,744.4353315128933,1051.112726829718,505.68148919713002,632.76152006252551,null,"Hijo 45 años",634.24767144650002,793.58084899443338,1120.5042195554829,539.06515251268331,674.5346480019]
[null,"Hijo 46 años",7282.9999999999991,9367,13014,6190.9999999999991,7961.9999999999991,null,"Hijo 46 años",619.90881767761277,797.29313403627623,1107.7156876639369,526.96079778142257,677.70341979255159,null,"Hijo 46 años",660.83344651571667,849.92817431178332,1180.8439479548999,561.74926093351667,722.4434849866999]
[null,"Hijo 47 años",7576.9999999999991,9834.9999999999982,13485,6439.9999999999991,8359.9999999999982,null,"Hijo 47 años",644.93328457274094,837.12799970607182,1147.805905036744,548.1549891313781,711.58007905874524,null,"Hijo 47 años",687.50995801861666,892.39282527558339,1223.58080821975,584.34263292066669,758.55658559266658]
[null,"Hijo 48 años",7882.9999999999991,10163,13826,6700,8639,null,"Hijo 48 años",670.97915827991505,865.04645256866399,1176.83088194572,570.28547005904238,735.32778743881602,null,"Hijo 48 años",715.27530672571663,922.15437552371657,1254.5219321057671,607.93410567833337,783.87205059031669]
[null,"Hijo 49 años",8247.0000000000018,10498,14349,7009.0000000000009,8923,null,"Hijo 49 años",701.96183157864539,893.56072607161616,1221.34719550406,596.58669546922818,759.50108199057252,null,"Hijo 49 años",748.30336858645001,952.55108080763341,1301.97708692215,635.97166368648345,809.64119775638346]
[null,"Hijo 50 años",8639.9999999999982,10905,14977,7344,9268.9999999999982,null,"Hijo 50 años",735.41290467315309,928.20344044684452,1274.800818667803,625.10096897218034,788.95164507123332,null,"Hijo 50 años",783.96278702400002,989.48080931675008,1358.959567275283,666.36836897040007,841.03600381081674]
[null,"Hijo 51 años",9037,11634,16096,7681,9889.0000000000018,null,"Hijo 51 años",769.2044467050099,990.25390427864158,1370.047003891096,653.78547694380666,841.72433036027928,null,"Hijo 51 años",819.98515119628348,1055.6276694718999,1460.493636566933,696.94654712168347,897.29259269448346]
[null,"Hijo 52 años",9505.0000000000018,12162,17296,8078.9999999999991,10338,null,"Hijo 52 años",809.03931237480595,1035.1958040086679,1472.187685095701,687.66213621000054,879.94196857766872,null,"Hijo 52 años",862.44980216008344,1103.5365064567,1569.377356986934,733.05964772765003,938.0332514183001]
[null,"Hijo 53 años",10018,12567,18289,8515,10682,null,"Hijo 53 años",852.70445358977418,1069.668283915222,1556.7090987925119,724.77325038100696,909.22229718965525,null,"Hijo 53 años",908.99759263963347,1140.2847620984501,1659.478635634483,772.62073281358346,969.24658460536671]
[null,"Hijo 54 años",10559,13107,19186,8974.0000000000018,11141,null,"Hijo 54 años",898.7528773661835,1115.6315904572939,1633.059257992953,763.84206094176841,948.2911077504167,null,"Hijo 54 años",958.08600326231669,1189.2824362874501,1740.8692166484329,814.26875587423342,1010.894607666017]
[null,"Hijo 55 años",11173,13690,19999,9496,11637,null,"Hijo 55 años",951.01485924920621,1165.2549380758639,1702.2595695090729,808.27325726577124,990.50925598165327,null,"Hijo 55 años",1013.798173543883,1242.1817771248329,1814.6379372329829,861.63317425693333,1055.8998787729499]
{"$rows_left_out":247}