{"text_format":"1","workbook":"xlsx","n_sheets":27,"sheets":["GuiadeUso","Panel","Afiliación débito","configuracion","Cotizador","desplegables ubigeo","Solicitud.Manual","Solicitud","PagodePrimasLocal1","PagodePrimasLocal2","PagodePrimasLocal3","CoberturasaElegirLocal1","CoberturasaElegirLocal2","CoberturasaElegirLocal3","CartillaVentaPyme","slipcotizador","Slip CONSOLIDADO","Slip Final","ACCO","CuestionarioTransporte","TransportistaTerrestre","PropietarioMercaderia","tablaTransportes","Hoja1","DatosdelNegocioLocal1","DatosdelNegocioLocal2","DatosdelNegocioLocal3"],"not_rendered":{"charts":0,"images":17,"macros":1,"external_links":5,"defined_names":52,"comments":0,"pivot_tables":0},"unopened":[],"bounds":{"document_bytes":16777216,"sheet_cells":100000,"rows_first":2000,"rows_last":500,"rows_between":2000,"halvings":0,"cell_chars":16384,"cell_head_chars":4096},"cells_cut":0,"cells_raw":0,"read":"whole","date_system":"1900"}

{"sheet":"GuiadeUso","index":0,"n_rows":46,"n_cols":5,"rows_kept":46,"cut":false,"hidden":false,"merged":[[3,4,4,9],[7,4,7,9],[9,2,11,9],[12,2,14,9]]}
[]
[]
[]
[]
[]
[]
[]
[null,null,null,null,"GUÍA DE USO - COTIZADOR PYME"]
[]
[null,null,"Este archivo debe usarse con versiones de Excel 2003 en adelante. Además, debe tener instalado el complemento de \"Guardar como PDF para Office\" en su PC."]
[]
[]
[null,null,"Si le apareciera el botón Habilitar Contenido, haga click en el mismo. Luego le aparecerá una ventana en la cual debe seleccionar la opción \"Habilitar Macros\" y dar click en Aceptar."]
[]
[]
[]
[null,null,"REALIZAR COTIZACIÓN"]
[null,null,"1. Los campos de color celeste  son obligatorios. Debe llenarlos sino no podrá continuar."]
[null,null,"2. Ud.  cuenta con 4 secciones:"]
[null,null,"(i)   Declaración de Bienes"]
[null,null,"(ii)  Coberturas"]
[null,null,"(iii) Datos del Negocio"]
[null,null,"(iv) Pago de Primas"]
[null,null,"3. Para obtener un archivo PDF de la Cotización de Seguro, debe presionar el botón: \"COTIZACIÓN EN PDF\""]
[]
[]
[null,null,"INGRESAR SOLICITUD"]
[null,null,"1. Los campos de color celeste  son obligatorios. Debe llenarlos sino no podrá continuar."]
[null,null,"2. Ud.  cuenta con 6 secciones:"]
[null,null,"(i)   Datos Generales -> Informacion del Asegurado"]
[null,null,"(ii)  Datos Generales -> Informacion del Contratante"]
[null,null,"(iii) Datos del Negocio (Datos vienen de la hoja Cotizador)"]
[null,null,"(iv) Declaracion Jurada"]
[null,null,"(v)  Pago de Primas (Datos vienen de la hoja Cotizador)"]
[null,null,"(vi) Datos del Corredor de Seguros"]
[null,null,"3. Para obtener un archivo PDF de la Solicitud de Seguro, debe presionar el botón: \"SOLICITUD DE SEGURO EN PDF\""]
[]
[]
[null,null,"SOLICITUD EN BLANCO"]
[null,null,"1.- Para imprimir una solicitud en blanco se presiona el botón: \"SOLICITUD EN BLANCO\""]
[]
[]
[null,null,"PARA EMISIÓN"]
[null,null,"1.- Enviar al buzon emisionrapida@pacifico.com.pe "]
[null,null,"(I)   Solicitud PDF firmada"]
[null,null,"(ii)  Slip de cotizacion"]

{"sheet":"Panel","index":1,"n_rows":27,"n_cols":10,"rows_kept":27,"cut":false,"hidden":false,"merged":[]}
[]
[]
[]
[]
[]
[]
[]
[]
[]
[]
[]
[]
[]
[]
[]
[]
[]
[]
[]
[]
[]
[]
[]
[]
[]
[]
[null,null,null,null,null,null,null,null,null,{"$f":"configuracion!$G$2","v":"JULIO 2022"}]

{"sheet":"Afiliación débito","index":2,"n_rows":90,"n_cols":41,"rows_kept":90,"cut":false,"hidden":false,"merged":[[13,26,13,28],[14,5,14,38],[16,35,16,37],[23,26,23,38],[34,2,34,3],[34,5,34,8],[33,29,33,31],[82,2,84,37],[86,2,87,37],[89,2,91,37],[92,3,92,9],[43,2,45,37],[49,26,49,38],[60,2,60,3],[60,5,60,8],[76,2,77,37],[79,2,80,37]]}
[null,null,null,null,null,null,null,null,null,null,null,null,null,null,null,null,null,null,null,null,null,null,null,null,null,null,null,null,null,null,null,null,null,null,null,null,null,null,null,null,"Ir a Panel"]
[]
[]
[]
[]
[]
[]
[]
[]
[]
[]
[]
[]
[null,null,"Modalidad de Pago"]
[null,null,"Contratante"]
[]
[null,null,"Tipo de documento",null,null,null,null,null,null,null,null,"Número",null,null,null,null,null,null,null,null,null,null,null,null,null,"Fecha",null,null,null,null,null,"Importe máximo"]
[null,null,null,null,null,null,null,null,null,null,null,null,null,null,null,null,null,null,null,null,null,null,null,null,null,null,null,"dd/","mm/","aa"]
[]
[null,null,"Producto: Pyme"]
[]
[null,null,"Formato de pago del depósito inicial (*)"]
[]
[null,null,"A) TARJETA DE CRÉDITO"]
[]
[null,null,"Entidad",null,null,null,null,null,null,null,null,"VISA",null,null,null,null,null,"MASTERCARD",null,null,null,null,null,null,null,"AMEX",null,null,null,null,"DINNERS"]
[]
[null,null,"Número de tarjeta"]
[]
[]
[]
[null,null,"Fecha de Vencimiento"]
[]
[null,null,null,null,"/",null,null,null,null,null,null,null,null,"Importe",null,null,null,null,null,null,".",null,null,null,null,null,"Moneda"]
[null,null,"mes",null,null,"año"]
[]
[null,null,"B) ABONO EN EFECTIVO EN LA CUENTA DE PACÍFICO SEGUROS"]
[null,null,"(En las cuentas que a continuación se indican solo deberá abonarse el monto del depósito inicial)"]
[]
[]
[]
[null,null,"Autorización de débito automático para cobranzas futuras"]
[]
[null,null,"Como titular de la cuenta bancaria y/o tarjeta de crédito indicada en el presente formato, autorizo sin requerir visto ni confirmación posterior se realicen los cargos automáticos de las primas que resulten de la contratación de la(s) pólizas(s) solicitadas(s) en la cuenta bancaria y/o tarjeta de crédito indicada en la siguiente solicitud, extendiéndose a la tarjeta de crédito que el Banco re emita por renovación, pérdida o robo."]
[]
[]
[]
[null,null,null,null,null,null,null,null,null,null,null,"Acepto",null,null,null,null,null,"No acepto"]
[]
[null,null,"A) TARJETA DE CRÉDITO"]
[]
[null,null,"Entidad",null,null,null,null,null,null,null,null,"VISA",null,null,null,null,null,"MASTERCARD",null,null,null,null,null,null,null,"AMEX",null,null,null,null,"DINNERS"]
[]
[null,null,"Número de tarjeta"]
[]
[]
[]
[null,null,"Fecha de Vencimiento"]
[]
[null,null,null,null,"/",null,null,null,null,null,null,null,null,"Importe",null,null,null,null,null,null,"."]
[null,null,"mes",null,null,"año"]
[]
[null,null,"Nota: Para las tarjetas Ripley Visa, se debe marcar VISA. Para las tarjetas Ripley Mastercard, se debe marcar Mastercard."]
[]
[null,null,"B) CUENTA BANCARIA"]
[]
[null,null,"N° de Cuenta",null,null,null,null,null,null,null,"D","C"]
[null,null,null,null,null,null,null,null,null,null,null,null,null,null,null,null,null,null,null,null,null,null,null,null,"Moneda:",null,null,"Soles",null,null,null,null,"Dólares"]
[null,null,null,null,null,null,null,null,null,null,9,10,null,12,13,14]
[]
[null,null,"BCP Cta. Cte. de Ahorros (14)",null,null,null,null,null,null,null,null,null,"Interbank Cta. Corriente (13)",null,null,null,null,null,null,null,null,null,null,null,"Scotiabank Cta. Ahorros (12)"]
[]
[null,null,"BCP Cta. Corriente (13)",null,null,null,null,null,null,null,null,null,"Interbank Cta. De Ahorros (13)",null,null,null,null,null,null,null,null,null,null,null,"Continental Cta. Corriente Nuevo (20)"]
[]
[null,null,"BCP Cta. Maestro (13)",null,null,null,null,null,null,null,null,null,"Scotiabank Cta. Corriente (12)",null,null,null,null,null,null,null,null,null,null,null,"Continental Cta. Ahorro Nuevo (20)"]
[]
[null,null,"Nota: En caso de haber elegido una Cuenta Bancaria, favor llenar en “N° de Cuenta” hasta el número indicado en el paréntesis correspondiente. Para cuentas del Continental, los digitos de control van en los casilleros 9 y 10."]
[]
[]
[null,null,"LA ACEPTACIÓN DEL CONTRATANTE AUTORIZA A PACÍFICO SEGUROS CARGARLE EN SU TARJETA DE CRÉDITO O CUENTA, DE ESTAR ÉSTAS VENCIDAS HASTA 3 CUOTAS."]
[]
[]
[null,null,"(*) El depósito inicial será imputado a la(s) prima(s) de seguro en caso se apruebe(n) su(s) solicitud(es) de seguro. En caso de rechazo, la Compañía reembolsará al Solicitante el importe total del depósito inicial en la Cuenta Bancaria declarada para el Débito Automático para Cobranzas Futuras o extornará a la Tarjeta de Crédito de la cual se realizó el cargo del depósito inicial."]
[]
[]
[]
[null,null,"PACÍFICO SEGUROS NO AUTORIZA A SU PERSONAL A RECIBIR SUMA ALGUNA DE DINERO EN FORMA PERSONAL. En este sentido, no se hace responsable por cualquier monto entregado al asesor o cualquier funcionario."]
[]
[]
[null,null,"EL CARGO EN TARJETA DE CRÉDITO SE EFECTUARÁ en moneda nacional de acuerdo al tipo de cambio del día de operación. Pacífico Seguros emitirá Facturas o boletas de venta. VISANET y Mastercard quedan excluidas de toda responsabilidad por la continuidad, cantidad y calidad de los bienes y/o servicios que Pacíficos Seguros se obliga a brindar al Usuario."]

{"sheet":"configuracion","index":3,"n_rows":35,"n_cols":28,"rows_kept":35,"cut":false,"hidden":false,"merged":[[1,3,1,4]]}
[null,null,null,null,null,null,"MES Y AÑO VIGENCIA",null,null,"DESCUENTO",null,null,null,"COD MATERIAL",null,null,10,32,4,4,32,null,null,10,10,1,1,10]
[null,null,null,"VARIABLES DE CONFIGURACIÓN",null,null,"JULIO 2022",null,null,0.15,null,null,null,null,null,null,"PISOS","PISOS","PISOS","PISOS","PISOS",null,null,"SOTANOS","SOTANOS","SOTANOS","SOTANOS","SOTANOS"]
[null,null,null,null,null,null,null,null,null,null,null,null,null,"3.0CA",null,null,"3.0CA","4.0CP","8.0M2R","9.0M2F","1.0AC",null,null,"3.0CA","4.0CP","8.0M2R","9.0M2F","1.0AC"]
[null,null,null,"Asesor / Corredor","Corredor",null,null,null,null,null,null,null,null,"4.0CP",null,null,1,1,1,1,1,null,null,0,0,0,0,0]
[null,null,null,null,null,null,null,null,null,null,null,null,null,"8.0M2R",null,null,{"$f":"Q4+1","v":2},{"$f":"R4+1","v":2},{"$f":"S4+1","v":2},{"$f":"T4+1","v":2},{"$f":"U4+1","v":2},null,null,{"$f":"X4+1","v":1},{"$f":"Y4+1","v":1},{"$f":"Z4+1","v":1},{"$f":"AA4+1","v":1},{"$f":"AB4+1","v":1}]
[null,null,null,null,null,null,null,null,null,null,null,null,null,"9.0M2F",null,null,{"$f":"Q5+1","v":3},3,3,3,3,null,null,{"$f":"X5+1","v":2},2,null,null,{"$f":"AB5+1","v":2}]
[null,null,null,null,null,null,null,null,null,null,null,null,null,"1.0AC",null,null,4,4,4,4,4,null,null,3,3,null,null,3]
[null,null,null,null,null,null,null,null,null,null,null,null,null,null,null,null,5,5,null,null,5,null,null,4,4,null,null,4]
[null,null,null,null,null,null,null,null,null,null,null,null,null,null,null,null,6,6,null,null,6,null,null,5,5,null,null,5]
[null,null,null,null,null,null,null,null,null,null,null,null,null,null,null,null,7,7,null,null,7,null,null,6,6,null,null,6]
[null,null,null,null,null,null,null,null,null,null,null,null,null,null,null,null,8,8,null,null,8,null,null,7,7,null,null,7]
[null,null,null,null,null,null,null,null,null,null,null,null,null,null,null,null,9,9,null,null,9,null,null,8,8,null,null,8]
[null,null,null,null,null,null,null,null,null,null,null,null,null,null,null,null,10,10,null,null,10,null,null,9,9,null,null,9]
[null,null,null,null,null,null,null,null,null,null,null,null,null,null,null,null,null,11,null,null,11,null,null,10,10,null,null,10]
[null,null,null,null,null,null,null,null,null,null,null,null,null,null,null,null,null,12,null,null,12]
[null,null,null,null,null,null,null,null,null,null,null,null,null,null,null,null,null,13,null,null,13]
[null,null,null,null,null,null,null,null,null,null,null,null,null,null,null,null,null,14,null,null,14]
[null,null,null,null,null,null,null,null,null,null,null,null,null,null,null,null,null,15,null,null,15]
[null,null,null,null,null,null,null,null,null,null,null,null,null,null,null,null,null,16,null,null,16]
[null,null,null,null,null,null,null,null,null,null,null,null,null,null,null,null,null,17,null,null,17]
[null,null,null,null,null,null,null,null,null,null,null,null,null,null,null,null,null,18,null,null,18]
[null,null,null,null,null,null,null,null,null,null,null,null,null,null,null,null,null,{"$f":"R21+1","v":19},null,null,{"$f":"U21+1","v":19}]
[null,null,null,null,null,null,null,null,null,null,null,null,null,null,null,null,null,20,null,null,20]
[null,null,null,null,null,null,null,null,null,null,null,null,null,null,null,null,null,21,null,null,21]
[null,null,null,null,null,null,null,null,null,null,null,null,null,null,null,null,null,22,null,null,22]
[null,null,null,null,null,null,null,null,null,null,null,null,null,null,null,null,null,23,null,null,23]
[null,null,null,null,null,null,null,null,null,null,null,null,null,null,null,null,null,24,null,null,24]
[null,null,null,null,null,null,null,null,null,null,null,null,null,null,null,null,null,25,null,null,25]
[null,null,null,null,null,null,null,null,null,null,null,null,null,null,null,null,null,26,null,null,26]
[null,null,null,null,null,null,null,null,null,null,null,null,null,null,null,null,null,27,null,null,27]
[null,null,null,null,null,null,null,null,null,null,null,null,null,null,null,null,null,28,null,null,28]
[null,null,null,null,null,null,null,null,null,null,null,null,null,null,null,null,null,29,null,null,29]
[null,null,null,null,null,null,null,null,null,null,null,null,null,null,null,null,null,30,null,null,30]
[null,null,null,null,null,null,null,null,null,null,null,null,null,null,null,null,null,31,null,null,31]
[null,null,null,null,null,null,null,null,null,null,null,null,null,null,null,null,null,32,null,null,32]

{"sheet":"Cotizador","index":4,"n_rows":171,"n_cols":30,"rows_kept":171,"cut":false,"hidden":false,"merged":[[170,2,171,18],[141,2,142,18],[144,2,147,18],[155,2,158,18],[150,2,153,18],[159,2,160,18],[162,2,162,13],[163,2,163,13],[166,2,167,18],[127,2,130,18],[131,2,131,18],[137,2,139,18],[120,2,124,18],[125,2,125,18],[134,2,135,18],[0,14,0,18],[19,14,19,18],[2,14,2,18],[21,12,21,13],[28,12,29,12],[5,12,5,13],[5,17,5,18],[28,13,29,13],[21,17,21,18],[28,17,29,17],[28,18,29,18],[7,12,7,13],[7,17,7,18],[13,2,13,6],[36,2,37,4],[36,17,37,17],[21,7,21,8],[28,8,29,8],[36,7,37,7],[14,2,14,6],[16,2,16,6],[15,2,15,6],[28,2,29,4],[1,1,1,8],[9,2,9,6],[10,2,10,6],[11,2,11,6],[12,2,12,6],[5,7,5,8],[7,7,7,8],[53,3,53,5],[28,7,29,7],[36,12,37,12],[76,14,76,18],[36,8,37,8],[57,3,57,5],[72,3,72,5],[74,3,74,5],[63,3,63,5],[65,3,65,5],[47,14,47,18],[36,13,37,13],[61,3,61,5],[30,2,30,4],[36,18,37,18],[71,3,71,5],[55,8,55,10],[55,12,55,14],[55,16,55,18],[111,2,114,15],[70,3,70,5],[55,3,55,5]]}
[0]
[null,{"$f":"\"Cotizador  Seguro Multiriesgo Pyme \" & configuracion!$G$2","v":"Cotizador  Seguro Multiriesgo Pyme JULIO 2022"}]
[]
[null,"Declaración de Bienes"]
[]
[null,null,null,null,null,null,null,"Local 1",null,null,null,null,"Local 2",null,null,null,null,"Local 3"]
[null,null,"Tipo de Moneda:","USD",null,"Endosado al Banco?:",null,null,"NO",null,null,null,null,"NO",null,null,null,null,"NO"]
[null,null,null,null,null,"A quien está endosado?:"]
[null,null,null,null,null,null,null,"Totales","Endosado",null,null,null,"Totales","Endosado",null,null,null,"Totales","Endosado"]
[null,null,"Edificio (sin considerar el valor del terreno)"]
[null,null,"Instalaciones fijas"]
[null,null,"Mobiliario y/o contenido propios del giro"]
[null,null,"Existencias propias del giro del negocio"]
[null,null,"Maquinaria propia del giro del negocio"]
[null,null,"Equipos electrónicos propios del giro del negocio"]
[null,null,"Lucro Cesante"]
[null,null,"TOTAL VALOR DECLARADO (Máximo 2'000,000 USD por local)",null,null,null,null,{"$f":"+IF(OR(SUM(H10:H16)<=0,SUM(H10:H16)>2000000),\"\",SUM(H10:H16))","v":""},{"$f":"+IF(H17=\"\",\"\",IF(I7=\"NO\",\"\",(IF(SUM(I10:I15)>SUM(H10:H15),\"\",SUM(I10:I15)))))","v":""},null,null,null,{"$f":"+IF(OR(SUM(M10:M16)<=0,SUM(M10:M16)>2000000),\"\",SUM(M10:M16))","v":""},{"$f":"+IF(M17=\"\",\"\",IF(N7=\"NO\",\"\",(IF(SUM(N10:N15)>SUM(M10:M15),\"\",SUM(N10:N15)))))","v":""},null,null,null,{"$f":"+IF(OR(SUM(R10:R16)<=0,SUM(R10:R16)>2000000),\"\",SUM(R10:R16))","v":""},{"$f":"+IF(R17=\"\",\"\",IF(S7=\"NO\",\"\",(IF(SUM(S10:S15)>SUM(R10:R15),\"\",SUM(S10:S15)))))","v":""}]
[]
[]
[]
[null,"Coberturas",null,null,null,null,null,null,null,null,null,null,null,null,null,null,null,null,null,null,null,null,null,null,null,null,null,null,null,{"$f":"AD22","v":2}]
[null,null,null,null,null,null,null,"Local 1",null,null,null,null,"Local 2",null,null,null,null,"Local 3",null,null,null,null,null,null,null,null,null,null,null,{"$f":"PagodePrimasLocal1!AD21","v":2}]
[null,null,"Robo y/o Asalto",null,null,"SI",null,"Valor Declarado","Suma Asegurada",null,"NO",null,"Valor Declarado","Suma Asegurada",null,"NO",null,"Valor Declarado","Suma Asegurada"]
[null,null,"Instalaciones fijas",null,null,null,null,{"$f":"+IF(H17=\"\",\"\",IF(F23=\"NO\",\"\",IF(H11>0,H11,\"\")))","v":""},{"$f":"+IF(H24=\"\",\"\",IF(H24>100000*CoberturasaElegirLocal1!$AC$5,100000*CoberturasaElegirLocal1!$AC$5,H24))","v":""},null,null,null,{"$f":"+IF(M17=\"\",\"\",IF(K23=\"NO\",\"\",IF(M11>0,M11,\"\")))","v":""},{"$f":"+IF(M24=\"\",\"\",IF(M24>100000*CoberturasaElegirLocal2!$AC$5,100000*CoberturasaElegirLocal2!$AC$5,M24))","v":""},null,null,null,{"$f":"+IF(R17=\"\",\"\",IF(P23=\"NO\",\"\",IF(R11>0,R11,\"\")))","v":""},{"$f":"+IF(R24=\"\",\"\",IF(R24>100000*CoberturasaElegirLocal3!$AC$5,100000*CoberturasaElegirLocal3!$AC$5,R24))","v":""}]
[null,null,"Mobiliario y/o contenido propios del giro del negocio",null,null,null,null,{"$f":"+IF(H17=\"\",\"\",IF(F23=\"NO\",\"\",IF(H12>0,H12,\"\")))","v":""},{"$f":"+IF(H25=\"\",\"\",IF(H25>100000*CoberturasaElegirLocal1!$AC$6,100000*CoberturasaElegirLocal1!$AC$6,H25))","v":""},null,null,null,{"$f":"+IF(M17=\"\",\"\",IF(K23=\"NO\",\"\",IF(M12>0,M12,\"\")))","v":""},{"$f":"+IF(M25=\"\",\"\",IF(M25>100000*CoberturasaElegirLocal2!$AC$6,100000*CoberturasaElegirLocal2!$AC$6,M25))","v":""},null,null,null,{"$f":"+IF(R17=\"\",\"\",IF(P23=\"NO\",\"\",IF(R12>0,R12,\"\")))","v":""},{"$f":"+IF(R25=\"\",\"\",IF(R25>100000*CoberturasaElegirLocal3!$AC$6,100000*CoberturasaElegirLocal3!$AC$6,R25))","v":""}]
[null,null,"Existencias propias del giro del negocio",null,null,null,null,{"$f":"+IF(H17=\"\",\"\",IF(F23=\"NO\",\"\",IF(H13>0,H13,\"\")))","v":""},{"$f":"+IF(H26=\"\",\"\",IF(H26>100000*CoberturasaElegirLocal1!$AC$7,100000*CoberturasaElegirLocal1!$AC$7,H26))","v":""},null,null,null,{"$f":"+IF(M17=\"\",\"\",IF(K23=\"NO\",\"\",IF(M13>0,M13,\"\")))","v":""},{"$f":"+IF(M26=\"\",\"\",IF(M26>100000*CoberturasaElegirLocal2!$AC$7,100000*CoberturasaElegirLocal2!$AC$7,M26))","v":""},null,null,null,{"$f":"+IF(R17=\"\",\"\",IF(P23=\"NO\",\"\",IF(R13>0,R13,\"\")))","v":""},{"$f":"+IF(R26=\"\",\"\",IF(R26>100000*CoberturasaElegirLocal3!$AC$7,100000*CoberturasaElegirLocal3!$AC$7,R26))","v":""}]
[null,null,"Maquinaria propia del giro del negocio",null,null,null,null,{"$f":"+IF(H17=\"\",\"\",IF(F23=\"NO\",\"\",IF(H14>0,H14,\"\")))","v":""},{"$f":"+IF(H27=\"\",\"\",IF(H27>100000*CoberturasaElegirLocal1!$AC$8,100000*CoberturasaElegirLocal1!$AC$8,H27))","v":""},null,null,null,{"$f":"+IF(M17=\"\",\"\",IF(K23=\"NO\",\"\",IF(M14>0,M14,\"\")))","v":""},{"$f":"+IF(M27=\"\",\"\",IF(M27>100000*CoberturasaElegirLocal2!$AC$8,100000*CoberturasaElegirLocal2!$AC$8,M27))","v":""},null,null,null,{"$f":"+IF(R17=\"\",\"\",IF(P23=\"NO\",\"\",IF(R14>0,R14,\"\")))","v":""},{"$f":"+IF(R27=\"\",\"\",IF(R27>100000*CoberturasaElegirLocal3!$AC$8,100000*CoberturasaElegirLocal3!$AC$8,R27))","v":""}]
[null,null,"Equipo electrónico fijo",null,null,null,null,{"$f":"+IF(H17=\"\",\"\",IF(F23=\"NO\",\"\",IF(H15>0,H15,\"\")))","v":""},{"$f":"+IF(H28=\"\",\"\",IF(H28>100000*CoberturasaElegirLocal1!$AC$9,100000*CoberturasaElegirLocal1!$AC$9,H28))","v":""},null,null,null,{"$f":"+IF(M17=\"\",\"\",IF(K23=\"NO\",\"\",IF(M15>0,M15,\"\")))","v":""},{"$f":"+IF(M28=\"\",\"\",IF(M28>100000*CoberturasaElegirLocal2!$AC$9,100000*CoberturasaElegirLocal2!$AC$9,M28))","v":""},null,null,null,{"$f":"+IF(R17=\"\",\"\",IF(P23=\"NO\",\"\",IF(R15>0,R15,\"\")))","v":""},{"$f":"+IF(R28=\"\",\"\",IF(R28>100000*CoberturasaElegirLocal3!$AC$9,100000*CoberturasaElegirLocal3!$AC$9,R28))","v":""}]
[null,null,"Dinero y/o valores dentro del local (caja chica y/o caja\nregistradora)",null,null,"SI",null,"---------",{"$f":"+IF(CoberturasaElegirLocal1!$AB$7=0,\"\",IF(F29=\"NO\",\"\",IF(CoberturasaElegirLocal1!$AB$7<3000,CoberturasaElegirLocal1!$AB$7,3000)))","v":""},null,"NO",null,"---------",{"$f":"+IF(CoberturasaElegirLocal2!$AB$7=0,\"\",IF(K29=\"NO\",\"\",IF(CoberturasaElegirLocal2!$AB$7<3000,CoberturasaElegirLocal2!$AB$7,3000)))","v":""},null,"NO",null,"---------",{"$f":"+IF(CoberturasaElegirLocal3!$AB$7=0,\"\",IF(P29=\"NO\",\"\",IF(CoberturasaElegirLocal3!$AB$7<3000,CoberturasaElegirLocal3!$AB$7,3000)))","v":""}]
[]
[null,null,"Dinero en Tránsito",null,null,"SI",null,"---------",{"$f":"+IF(CoberturasaElegirLocal1!$AB$7=0,\"\",IF(F31=\"NO\",\"\",IF(CoberturasaElegirLocal1!$AB$7<3000,CoberturasaElegirLocal1!$AB$7,3000)))","v":""},null,"NO",null,"---------",{"$f":"+IF(CoberturasaElegirLocal2!$AB$7=0,\"\",IF(K31=\"NO\",\"\",IF(CoberturasaElegirLocal2!$AB$7<3000,CoberturasaElegirLocal2!$AB$7,3000)))","v":""},null,"NO",null,"---------",{"$f":"+IF(CoberturasaElegirLocal3!$AB$7=0,\"\",IF(P31=\"NO\",\"\",IF(CoberturasaElegirLocal3!$AB$7<3000,CoberturasaElegirLocal3!$AB$7,3000)))","v":""}]
[]
[null,null,"Responsabilidad Civil",null,null,"SI","Opción:",1,{"$f":"IF(H17=\"\",\"\",IF(F33=\"NO\",\"\",IF(H33=1,50000,IF(H33=2,100000,IF(H33=3,200000,IF(H33=4,300000,500000))))))","v":""},null,"NO",null,1,{"$f":"IF(M17=\"\",\"\",IF(K33=\"NO\",\"\",IF(M33=1,50000,IF(M33=2,100000,IF(M33=3,200000,IF(M33=4,300000,500000))))))","v":""},null,"NO",null,1,{"$f":"IF(R17=\"\",\"\",IF(P33=\"NO\",\"\",IF(R33=1,50000,IF(R33=2,100000,IF(R33=3,200000,IF(R33=4,300000,500000))))))","v":""}]
[]
[null,null,"Equipo Electrónico"]
[null,null,"Equipos electrónicos propios del giro del negocio",null,null,"NO",null,{"$f":"+IF(H17=\"\",\"\",IF(F36=\"NO\",\"\",IF(H15>0,H15,\"\")))","v":""},{"$f":"+IF(H36=\"\",\"\",IF(H36>50000,50000,H36))","v":""},null,"NO",null,{"$f":"+IF(M17=\"\",\"\",IF(K36=\"NO\",\"\",IF(M15>0,M15,\"\")))","v":""},{"$f":"+IF(M36=\"\",\"\",IF(M36>50000,50000,M36))","v":""},null,"NO",null,{"$f":"+IF(R17=\"\",\"\",IF(P36=\"NO\",\"\",IF(R15>0,R15,\"\")))","v":""},{"$f":"+IF(R36=\"\",\"\",IF(R36>50000,50000,R36))","v":""}]
[null,null,"Equipos móviles y portátiles fuera del predio limitado a laptops y/o notebooks",null,null,"NO",null,{"$f":"+IF(F37=\"NO\",\"\",IF(I36=\"\",\"\",IF(3000>I36,I36,3000)))","v":""},{"$f":"+IF(H37=\"\",\"\",H37)","v":""},null,"NO",null,{"$f":"+IF(K37=\"NO\",\"\",IF(N36=\"\",\"\",IF(3000>N36,N36,3000)))","v":""},{"$f":"+IF(M37=\"\",\"\",M37)","v":""},null,"NO",null,{"$f":"+IF(P37=\"NO\",\"\",IF(S36=\"\",\"\",IF(3000>S36,S36,3000)))","v":""},{"$f":"+IF(R37=\"\",\"\",R37)","v":""}]
[]
[]
[null,null,"Rotura de Maquinaria",null,null,"NO",null,{"$f":"+IF(H17=\"\",\"\",IF(F40=\"NO\",\"\",IF(H14>0,H14,\"\")))","v":""},{"$f":"+IF(H40=\"\",\"\",IF(H40>200000,200000,H40))","v":""},null,"NO",null,{"$f":"+IF(M17=\"\",\"\",IF(K40=\"NO\",\"\",IF(M14>0,M14,\"\")))","v":""},{"$f":"+IF(M40=\"\",\"\",IF(M40>200000,200000,M40))","v":""},null,"NO",null,{"$f":"+IF(R17=\"\",\"\",IF(P40=\"NO\",\"\",IF(R14>0,R14,\"\")))","v":""},{"$f":"+IF(R40=\"\",\"\",IF(R40>200000,200000,R40))","v":""}]
[]
[]
[]
[null,null,"Accidentes Colectivos",null,null,"NO",null,"Nº asegurados: ",{"$f":"IF($F$44=\"SÍ\",ACCO!$E$18,\"\")","v":""},null,"NO",null,null,{"$f":"IF($K$44=\"SÍ\",ACCO!$F$18,\"\")","v":""},null,"NO",null,null,{"$f":"IF($P$44=\"SÍ\",ACCO!$G$18,\"\")","v":""}]
[]
[null,null,"Transporte nacional",null,null,"NO",null,"Movimiento Anual",{"$f":"IF($F$46=\"SÍ\",CuestionarioTransporte!$D$24,\"\")","v":""}]
[]
[]
[null,"Datos del Negocio"]
[]
[null,"Actividad Realizada",null,null,null,null,null,"Dirección de los locales por asegurar:"]
[null,null,null,null,null,null,null,null,"Local 1",null,null,null,"Local 2",null,null,null,"Local 3"]
[null,null,"Actividad y/o Giro:",null,null,null,null,"Departamento"]
[null,null,"Local 1",null,null,null,null,"Provincia"]
[null,null,null,null,null,null,null,"Distrito"]
[null,null,"Local 2",null,null,null,null,"Dirección exacta del riesgo:*:"]
[null,null,null,null,null,null,null,"Nro"]
[null,null,"Local 3"]
[]
[null,"Tipo de Negocio"]
[null,null,"Tipo:"]
[null,null,"Local 1","Comercial y Servicios"]
[]
[null,null,"Local 2","Comercial y Servicios"]
[]
[null,null,"Local 3","Comercial y Servicios"]
[]
[null,"Uso del Local"]
[]
[null,null,"Ocupación:"]
[null,null,"Local 1"]
[]
[null,null,"Local 2"]
[]
[null,null,"Local 3"]
[]
[]
[null,"Pago de Primas"]
[]
[null,null,"Autorizaciones"]
[null,null,null,"Documento Contratante"]
[null,null,null,"Forma de pago",null,null,null,"Emitir Factura?"]
[null,null,null,"Descuento de 15% por afiliación al débito automático y emisión de póliza electrónica"]
[]
[null,null,"Inicio de Vigencia y Pago"]
[]
[null,null,null,"Forma de pago",null,null,null,"Nro. Cuotas:"]
[null,null,null,"Al Contado",null,null,null,"Inicio Vigencia Póliza:"]
[null,null,null,"En cuotas"]
[null,null,null,null,null,null,null,null,"Local 1",null,"Local 2",null,"Local 3",null,null,"Total"]
[null,null,null,null,null,null,null,"Prima Comercial",{"$f":"IF(E82=\"Débito Automático\",PagodePrimasLocal1!$AH$10,IF(AND(PagodePrimasLocal1!$AD$21=1,I87=\"\"),PagodePrimasLocal1!$AH$10,IF(I87=\"\",\"----\",PagodePrimasLocal1!$AH$10)))","v":"----"},null,{"$f":"IF(E82=\"Débito Automático\",PagodePrimasLocal2!$AH$10,IF(AND(PagodePrimasLocal2!$AD$21=1,I87=\"\"),PagodePrimasLocal2!$AH$10,IF(I87=\"\",\"----\",PagodePrimasLocal2!$AH$10)))","v":"----"},null,{"$f":"IF(E82=\"Débito Automático\",PagodePrimasLocal3!$AH$10,IF(AND(PagodePrimasLocal3!$AD$21=1,I87=\"\"),PagodePrimasLocal3!$AH$10,IF(I87=\"\",\"----\",PagodePrimasLocal3!$AH$10)))","v":"----"},null,"Prima Comercial",{"$f":"SUM(I91,K91,M91)","v":0}]
[null,null,null,null,null,null,null,"Intereses (*)",{"$f":"IF(E82=\"Débito Automático\",0,IF(ISERROR(IF(I87=\"\",0,(PagodePrimasLocal1!$AG$12-PagodePrimasLocal1!$AG$10)/1.18)),0,IF(I87=\"\",0,(PagodePrimasLocal1!$AG$12-PagodePrimasLocal1!$AG$10)/1.18)))","v":0},null,{"$f":"IF(E82=\"Débito Automático\",0,IF(ISERROR(IF(I87=\"\",0,(PagodePrimasLocal2!$AG$12-PagodePrimasLocal2!$AG$10)/1.18)),0,IF(I87=\"\",0,(PagodePrimasLocal2!$AG$12-PagodePrimasLocal2!$AG$10)/1.18)))","v":0},null,{"$f":"IF(E82=\"Débito Automático\",0,IF(ISERROR(IF(I87=\"\",0,(PagodePrimasLocal3!$AG$12-PagodePrimasLocal3!$AG$10)/1.18)),0,IF(I87=\"\",0,(PagodePrimasLocal3!$AG$12-PagodePrimasLocal3!$AG$10)/1.18)))","v":0},null,"Intereses (*)",{"$f":"SUM(I92,K92,M92)","v":0},"Dscto","Total"]
[null,null,null,null,null,null,null,"18 % I.G.V.",{"$f":"SUM(I91:I92)*0.18","v":0},null,{"$f":"SUM(K91:K92)*0.18","v":0},null,{"$f":"SUM(M91:M92)*0.18","v":0},null,"18% I.G.V.",{"$f":"I93+K93+M93","v":0},0.15,"Final"]
[null,null,null,null,null,null,null,"Total a Pagar",{"$f":"SUM(I91:I93)","v":0},null,{"$f":"SUM(K91:K93)","v":0},null,{"$f":"SUM(M91:M93)","v":0},null,"Total a Pagar",{"$f":"I94+K94+M94","v":0},{"$f":"IFERROR(IF($I$94-$I$94*$Q$93<120,0,$I$94*$Q$93)+IF($K$94-$K$94*$Q$93<120,0,$K$94*$Q$93)+IF($M$94-$M$94*$Q$93<120,0,$M$94*$Q$93),0)","v":0},{"$f":"IFERROR(P94-Q94,0)","v":0}]
[null,null,null,null,null,null,null,"Cuota",{"$f":"IFERROR(I94/$I$87,\"\")","v":""},null,{"$f":"IFERROR(K94/$I$87,\"\")","v":""},null,{"$f":"IFERROR(M94/$I$87,\"\")","v":""},null,"Cuota",{"$f":"IFERROR(I95+K95+M95,\"\")","v":""},{"$f":"IFERROR(IF($I$94-$I$94*$Q$93<120,0,$I$95*$Q$93)+IF($K$94-$K$94*$Q$93<120,0,$K$95*$Q$93)+IF($M$94-$M$94*$Q$93<120,0,$M$95*$Q$93),0)","v":0},{"$f":"IFERROR(P95-Q95,0)","v":0}]
[]
[]
[]
[]
[]
[]
[]
[]
[null,null,"(*) Los intereses aplican para la forma de pago con Cupones y para los fraccionamientos en 6 y 10 cuotas. La TEA es de 17.5% para persona natural y de 12% para persona jurídica."]
[]
[]
[]
[]
[]
[]
[]
[null,null,"Se deja constancia expresa que, a potestad de la Compañía, la aceptación final del riesgo por parte de ésta queda sujeta a la realización de la inspección o evaluación, por parte de nuestro Departamento de Ingeniería o la persona autorizada para tal efecto, para verificar el efectivo estado del riesgo, así como el estricto cumplimiento por parte del Asegurado de las garantías que a mérito de dicha inspección establezca el Departamento de Ingeniería de la Compañía."]
[]
[]
[]
[]
[]
[null,"IMPORTANTE"]
[]
[null,null,"Aprobación de la solicitud de seguro"]
[null,null,"PACÍFICO SEGUROS entregará la póliza de seguro al Contratante dentro del plazo de 15 días calendario de haber recibido la solicitud, si es que no es rechazada.\nNo obstante, cuando corresponda, PACÍFICO SEGUROS se obliga a comunicar el rechazo de la solicitud dentro del plazo de 15 días calendario de recibida, salvo que PACÍFICO SEGUROS haya requerido información adicional y/u otros requerimientos adicionales, necesarios para la evaluación del riesgo, dentro del referido plazo. En este caso, el plazo para comunicar el rechazo se contará a partir de la recepción de la información completa solicitada y de cumplidos los requerimientos realizados por PACÍFICO SEGUROS. En el supuesto que el Contratante no complete la información solicitada por PACÍFICO SEGUROS y/o no cumpla con los requerimientos que PACÍFICO SEGUROS haya realizado, se considerará rechazada la solicitud."]
[]
[]
[]
[]
[null,null,"Medios de comunicación pactados: Escritos (correo electrónico o comunicaciones enviadas al domicilio físico) y telefónicas."]
[]
[null,null,"Autorizo a PACÍFICO SEGUROS, a que en el caso de aprobar la presente solicitud, pueda enviar válidamente cualquier comunicación y/o notiﬁcación vinculada con este seguro durante su vigencia por cualquiera de los medios de comunicación arriba indicados, precisándose que las comunicaciones por teléfono se realizarán únicamente en aquellos casos en que la comunicación escrita no sea requerida de forma especíﬁca, conforme al marco normativo vigente. Declaro igualmente conocer y estar de acuerdo con que las comunicaciones y/o notiﬁcaciones que sean dirigidas a mi correo electrónico surtirán efectos y las consideraré recibidas a partir del momento en que éstas sean recibidas en el servidor de mi cuenta del correo electrónico, considerándose igualmente que en ese momento he tomado conocimiento del contenido del documento enviado por dicho medio."]
[]
[]
[]
[null,null,"Se enviará comunicaciones por escrito al domicilio físico del contratante y/o asegurado, en caso la normatividad vigente lo exija o, no se consigne una dirección electrónica."]
[]
[null,null,"PROTECCIÓN DE DATOS PERSONALES"]
[null,null,"Para la correcta ejecución de la relación contractual, EL CONTRATANTE / ASEGURADO (“EL CLIENTE”) se obliga a mantener actualizada su información personal, financiera y crediticia (“LA INFORMACIÓN”) y reconoce que PACÍFICO SEGUROS podrá tratarla, actualizarla, completarla y realizar flujos transfronterizos conforme a ley."]
[]
[]
[null,null,"PACÍFICO SEGUROS conservará, tratará y realizará flujos transfronterizos con LA INFORMACIÓN de EL CLIENTE mientras se mantenga la relación contractual y luego de veinte (20) años de finalizado el contrato.\nPara el tratamiento de La INFORMACIÓN de EL CLIENTE, PACÍFICO SEGUROS utilizará diversos Encargados ubicados en el Perú y el extranjero, los cuales se han puesto a disposición del El cliente y también se encuentran detallados en https://www.pacifico.com.pe/transparencia/politica-privacidad"]
[]
[]
[]
[null,null," Su información será incluida en el banco de datos de Usuarios que se encuentra registrado ante la Autoridad de Protección de Datos Personales bajo el número de registro RNPDP-PJ N.° 774, de titularidad de PACÍFICO SEGUROS, ubicada en Juan de Arona 830, San Isidro, Lima - Perú."]
[]
[]
[null,null,"EL CLIENTE puede ejercer los derechos de acceso, rectificación, cancelación, revocación y oposición, dirigiéndose a PACÍFICO SEGUROS de forma presencial en cualquiera de sus oficinas a nivel nacional en el horario establecido para la atención al público o por teléfono o a través del Chat ubicado en nuestra página web www.pacifico.com.pe.\nEl detalle de nuestra Política de Privacidad se encuentra disponible en: \nhttps://www.pacifico.com.pe/transparencia/politica-privacidad"]
[]
[]
[]
[]
[null,null,"AUTORIZACIONES PARA USOS ADICIONALES"]
[null,null,"EL CLIENTE autoriza que PACÍFICO SEGUROS, de manera directa o a través de sus Encargados:\n- Le oferte cualquiera de nuestros productos de los ramos de Riesgos Generales o de Vida.\n- Le oferte cualquier otro producto o servicio de PACÍFICO SEGUROS o de sus empresas terceras.\n- A transferir su Información a empresas Credicorp (incluyendo subsidiarias, vinculadas y afiliadas) así como socios comerciales (Terceros), para que cada uno de ellos pueda ofertar sus productos o servicios. "]
[]
[]
[]
[]
[null,null,"EL CLIENTE acepta haber tenido a su disposición la lista de Terceros y Encargados que también se encuentra disponible en https://www.pacifico.com.pe/transparencia/politica-privacidad. Dicha lista detalla los posibles usos que los Terceros darán a sus datos personales. El envío de comunicaciones o mensajes con las ofertas y/o publicidades podrá ser remitida a través de medios escritos, verbales (por ejemplo: mensajes, push notification o llamadas telefónicas) o electrónicos/informáticos (por ejemplo correo electrónico)."]
[]
[]
[]
[null,null,"PACÍFICO SEGUROS y los Terceros podrán conservar y tratar LA INFORMACIÓN de EL CLIENTE en los términos establecidos en esta sección, mientras se mantenga la relación contractual y luego de veinte (20) años de finalizado el contrato.\nLa aceptación o no de esta autorización para usos adicionales (ajenos a la ejecución de la relación contractual) no condiciona la prestación del servicio que EL CLIENTE está contratando."]
[]
[]
[null,null,"Sí acepto",null,null,null,null,null,null,null,null,null,null,null,""]
[null,null,"No acepto y prefiero perder la oportunidad de recibir nuevas ofertas",null,null,null,null,null,null,null,null,null,null,null,""]
[]
[null,null,"Cláusulas Abusivas"]
[null,null,"“Las condiciones de la presente póliza se encuentran sujetas a una revisión posterior por parte de la Superintendencia de Banca, Seguros y AFPs, por lo que, en caso se identiﬁquen cláusulas abusivas en el marco de la Ley del Contrato de Seguro y normas reglamentarias, y estas no sean subsanadas por PACÍFICO SEGUROS, la Superintendencia de Banca, Seguros y AFPs,"]
[]
[]
[null,null,"Derecho de arrepentimiento"]
[null,null,"En el caso que este seguro sea ofertado por un comercializador (incluyendo la Bancaseguro), declaro conocer que tengo derecho a arrepentirme de la contratación de este seguro, sin expresión de causa ni penalidad alguna, dentro del plazo de 15 días de recibir la póliza de seguro o el certiﬁcado de seguro, de ser el caso, ya que se me devuelva la prima que hubiere pagado."]

{"sheet":"desplegables ubigeo","index":5,"n_rows":1877,"n_cols":24,"rows_kept":1877,"cut":false,"hidden":false,"merged":[[1,11,1,13]]}
[null,"CÓDIGOS DE UBICACIÓN GEOGRÁFICA"]
[null,"DEPARTAMENTO","PROVINCIA","DISTRITO",null,null,null,null,null,null,null,"DESPLEGABLES"]
[null,"DEPARTAMENTO","PROVINCIA","DISTRITO","COD DEPARTAMENTO","COD PROVINCIA","COD DISTRITO","DESC DEPARTAMENTO","DESC PROVINCIA","DESC DISTRITO","COMBINACIÓN","DEPARTAMENTO","PROVINCIA","DISTRITO","COD DEPARTAMENTO","COD PROVINCIA","COD DISTRITO",null,null,null,null,null,"DEPARTAMENTO","PROVINCIA"]
[null,"01 Amazonas","01 Chachapoyas","01 Chachapoyas",{"$f":"+MID(B4,1,2)","v":"01"},"01","01","Amazonas","Chachapoyas","Chachapoyas",{"$f":"+CONCATENATE(E4,F4,G4)","v":"010101"},"AMAZONAS","CHACHAPOYAS","CHACHAPOYAS","01","01","01",null,null,null,null,null,"AMAZONAS","CALLAO"]
[null,"01 Amazonas","01 Chachapoyas","02 Asunción","01","01","02","Amazonas","Chachapoyas","Asunción","010102","AMAZONAS","CHACHAPOYAS","ASUNCIÓN","01","01","02",null,null,null,null,null,"ÁNCASH","LIMA"]
[null,"01 Amazonas","01 Chachapoyas","03 Balsas","01","01","03","Amazonas","Chachapoyas","Balsas","010103","AMAZONAS","CHACHAPOYAS","BALSAS","01","01","03",null,null,null,null,null,"APURÍMAC","BARRANCA"]
[null,"01 Amazonas","01 Chachapoyas","04 Cheto","01","01","04","Amazonas","Chachapoyas","Cheto","010104","AMAZONAS","CHACHAPOYAS","CHETO","01","01","04",null,null,null,null,null,"AREQUIPA","CAJATAMBO"]
[null,"01 Amazonas","01 Chachapoyas","05 Chiliquin","01","01","05","Amazonas","Chachapoyas","Chiliquin","010105","AMAZONAS","CHACHAPOYAS","CHILIQUIN","01","01","05",null,null,null,null,null,"AYACUCHO","CANTA"]
[null,"01 Amazonas","01 Chachapoyas","06 Chuquibamba","01","01","06","Amazonas","Chachapoyas","Chuquibamba","010106","AMAZONAS","CHACHAPOYAS","CHUQUIBAMBA","01","01","06",null,null,null,null,null,"CAJAMARCA","CAÑETE"]
[null,"01 Amazonas","01 Chachapoyas","07 Granada","01","01","07","Amazonas","Chachapoyas","Granada","010107","AMAZONAS","CHACHAPOYAS","GRANADA","01","01","07",null,null,null,null,null,"CUSCO","HUARAL"]
[null,"01 Amazonas","01 Chachapoyas","08 Huancas","01","01","08","Amazonas","Chachapoyas","Huancas","010108","AMAZONAS","CHACHAPOYAS","HUANCAS","01","01","08",null,null,null,null,null,"HUANCAVELICA","HUAROCHIRÍ"]
[null,"01 Amazonas","01 Chachapoyas","09 La Jalca","01","01","09","Amazonas","Chachapoyas","La Jalca","010109","AMAZONAS","CHACHAPOYAS","LA JALCA","01","01","09",null,null,null,null,null,"HUÁNUCO","HUAURA"]
[null,"01 Amazonas","01 Chachapoyas","10 Leimebamba","01","01","10","Amazonas","Chachapoyas","Leimebamba","010110","AMAZONAS","CHACHAPOYAS","LEIMEBAMBA","01","01","10",null,null,null,null,null,"ICA","OYÓN"]
[null,"01 Amazonas","01 Chachapoyas","11 Levanto","01","01","11","Amazonas","Chachapoyas","Levanto","010111","AMAZONAS","CHACHAPOYAS","LEVANTO","01","01","11",null,null,null,null,null,"JUNÍN","YAUYOS"]
[null,"01 Amazonas","01 Chachapoyas","12 Magdalena","01","01","12","Amazonas","Chachapoyas","Magdalena","010112","AMAZONAS","CHACHAPOYAS","MAGDALENA","01","01","12",null,null,null,null,null,"LA LIBERTAD"]
[null,"01 Amazonas","01 Chachapoyas","13 Mariscal Castilla","01","01","13","Amazonas","Chachapoyas","Mariscal Castilla","010113","AMAZONAS","CHACHAPOYAS","MARISCAL CASTILLA","01","01","13",null,null,null,null,null,"LAMBAYEQUE"]
[null,"01 Amazonas","01 Chachapoyas","14 Molinopampa","01","01","14","Amazonas","Chachapoyas","Molinopampa","010114","AMAZONAS","CHACHAPOYAS","MOLINOPAMPA","01","01","14",null,null,null,null,null,"LIMA"]
[null,"01 Amazonas","01 Chachapoyas","15 Montevideo","01","01","15","Amazonas","Chachapoyas","Montevideo","010115","AMAZONAS","CHACHAPOYAS","MONTEVIDEO","01","01","15",null,null,null,null,null,"LORETO"]
[null,"01 Amazonas","01 Chachapoyas","16 Olleros","01","01","16","Amazonas","Chachapoyas","Olleros","010116","AMAZONAS","CHACHAPOYAS","OLLEROS","01","01","16",null,null,null,null,null,"MADRE DE DIOS"]
[null,"01 Amazonas","01 Chachapoyas","17 Quinjalca","01","01","17","Amazonas","Chachapoyas","Quinjalca","010117","AMAZONAS","CHACHAPOYAS","QUINJALCA","01","01","17",null,null,null,null,null,"MOQUEGUA"]
[null,"01 Amazonas","01 Chachapoyas","18 San Francisco de Daguas","01","01","18","Amazonas","Chachapoyas","San Francisco de Daguas","010118","AMAZONAS","CHACHAPOYAS","SAN FRANCISCO DE DAGUAS","01","01","18",null,null,null,null,null,"PASCO"]
[null,"01 Amazonas","01 Chachapoyas","19 San Isidro de Maino","01","01","19","Amazonas","Chachapoyas","San Isidro de Maino","010119","AMAZONAS","CHACHAPOYAS","SAN ISIDRO DE MAINO","01","01","19",null,null,null,null,null,"PIURA"]
[null,"01 Amazonas","01 Chachapoyas","20 Soloco","01","01","20","Amazonas","Chachapoyas","Soloco","010120","AMAZONAS","CHACHAPOYAS","SOLOCO","01","01","20",null,null,null,null,null,"PUNO"]
[null,"01 Amazonas","01 Chachapoyas","21 Sonche","01","01","21","Amazonas","Chachapoyas","Sonche","010121","AMAZONAS","CHACHAPOYAS","SONCHE","01","01","21",null,null,null,null,null,"SAN MARTÍN"]
[null,"01 Amazonas","02 Bagua","01 Bagua","01","02","01","Amazonas","Bagua","Bagua","010201","AMAZONAS","BAGUA","BAGUA","01","02","01",null,null,null,null,null,"TACNA"]
[null,"01 Amazonas","02 Bagua","02 Aramango","01","02","02","Amazonas","Bagua","Aramango","010202","AMAZONAS","BAGUA","ARAMANGO","01","02","02",null,null,null,null,null,"TUMBES"]
[null,"01 Amazonas","02 Bagua","03 Copallin","01","02","03","Amazonas","Bagua","Copallin","010203","AMAZONAS","BAGUA","COPALLIN","01","02","03",null,null,null,null,null,"UCAYALI"]
[null,"01 Amazonas","02 Bagua","04 El Parco","01","02","04","Amazonas","Bagua","El Parco","010204","AMAZONAS","BAGUA","EL PARCO","01","02","04"]
[null,"01 Amazonas","02 Bagua","05 Imaza","01","02","05","Amazonas","Bagua","Imaza","010205","AMAZONAS","BAGUA","IMAZA","01","02","05"]
[null,"01 Amazonas","02 Bagua","06 La Peca","01","02","06","Amazonas","Bagua","La Peca","010206","AMAZONAS","BAGUA","LA PECA","01","02","06"]
[null,"01 Amazonas","03 Bongará","01 Jumbilla","01","03","01","Amazonas","Bongará","Jumbilla","010301","AMAZONAS","BONGARÁ","JUMBILLA","01","03","01"]
[null,"01 Amazonas","03 Bongará","02 Chisquilla","01","03","02","Amazonas","Bongará","Chisquilla","010302","AMAZONAS","BONGARÁ","CHISQUILLA","01","03","02"]
[null,"01 Amazonas","03 Bongará","03 Churuja","01","03","03","Amazonas","Bongará","Churuja","010303","AMAZONAS","BONGARÁ","CHURUJA","01","03","03"]
[null,"01 Amazonas","03 Bongará","04 Corosha","01","03","04","Amazonas","Bongará","Corosha","010304","AMAZONAS","BONGARÁ","COROSHA","01","03","04"]
[null,"01 Amazonas","03 Bongará","05 Cuispes","01","03","05","Amazonas","Bongará","Cuispes","010305","AMAZONAS","BONGARÁ","CUISPES","01","03","05"]
[null,"01 Amazonas","03 Bongará","06 Florida","01","03","06","Amazonas","Bongará","Florida","010306","AMAZONAS","BONGARÁ","FLORIDA","01","03","06"]
[null,"01 Amazonas","03 Bongará","07 Jazan","01","03","07","Amazonas","Bongará","Jazan","010307","AMAZONAS","BONGARÁ","JAZAN","01","03","07"]
[null,"01 Amazonas","03 Bongará","08 Recta","01","03","08","Amazonas","Bongará","Recta","010308","AMAZONAS","BONGARÁ","RECTA","01","03","08"]
[null,"01 Amazonas","03 Bongará","09 San Carlos","01","03","09","Amazonas","Bongará","San Carlos","010309","AMAZONAS","BONGARÁ","SAN CARLOS","01","03","09"]
[null,"01 Amazonas","03 Bongará","10 Shipasbamba","01","03","10","Amazonas","Bongará","Shipasbamba","010310","AMAZONAS","BONGARÁ","SHIPASBAMBA","01","03","10"]
[null,"01 Amazonas","03 Bongará","11 Valera","01","03","11","Amazonas","Bongará","Valera","010311","AMAZONAS","BONGARÁ","VALERA","01","03","11"]
[null,"01 Amazonas","03 Bongará","12 Yambrasbamba","01","03","12","Amazonas","Bongará","Yambrasbamba","010312","AMAZONAS","BONGARÁ","YAMBRASBAMBA","01","03","12"]
[null,"01 Amazonas","04 Condorcanqui","01 Nieva","01","04","01","Amazonas","Condorcanqui","Nieva","010401","AMAZONAS","CONDORCANQUI","NIEVA","01","04","01"]
[null,"01 Amazonas","04 Condorcanqui","02 El Cenepa","01","04","02","Amazonas","Condorcanqui","El Cenepa","010402","AMAZONAS","CONDORCANQUI","EL CENEPA","01","04","02"]
[null,"01 Amazonas","04 Condorcanqui","03 Río Santiago","01","04","03","Amazonas","Condorcanqui","Río Santiago","010403","AMAZONAS","CONDORCANQUI","RÍO SANTIAGO","01","04","03"]
[null,"01 Amazonas","05 Luya","01 Lamud","01","05","01","Amazonas","Luya","Lamud","010501","AMAZONAS","LUYA","LAMUD","01","05","01"]
[null,"01 Amazonas","05 Luya","02 Camporredondo","01","05","02","Amazonas","Luya","Camporredondo","010502","AMAZONAS","LUYA","CAMPORREDONDO","01","05","02"]
[null,"01 Amazonas","05 Luya","03 Cocabamba","01","05","03","Amazonas","Luya","Cocabamba","010503","AMAZONAS","LUYA","COCABAMBA","01","05","03"]
[null,"01 Amazonas","05 Luya","04 Colcamar","01","05","04","Amazonas","Luya","Colcamar","010504","AMAZONAS","LUYA","COLCAMAR","01","05","04"]
[null,"01 Amazonas","05 Luya","05 Conila","01","05","05","Amazonas","Luya","Conila","010505","AMAZONAS","LUYA","CONILA","01","05","05"]
[null,"01 Amazonas","05 Luya","06 Inguilpata","01","05","06","Amazonas","Luya","Inguilpata","010506","AMAZONAS","LUYA","INGUILPATA","01","05","06"]
[null,"01 Amazonas","05 Luya","07 Longuita","01","05","07","Amazonas","Luya","Longuita","010507","AMAZONAS","LUYA","LONGUITA","01","05","07"]
[null,"01 Amazonas","05 Luya","08 Lonya Chico","01","05","08","Amazonas","Luya","Lonya Chico","010508","AMAZONAS","LUYA","LONYA CHICO","01","05","08"]
[null,"01 Amazonas","05 Luya","09 Luya","01","05","09","Amazonas","Luya","Luya","010509","AMAZONAS","LUYA","LUYA","01","05","09"]
[null,"01 Amazonas","05 Luya","10 Luya Viejo","01","05","10","Amazonas","Luya","Luya Viejo","010510","AMAZONAS","LUYA","LUYA VIEJO","01","05","10"]
[null,"01 Amazonas","05 Luya","11 María","01","05","11","Amazonas","Luya","María","010511","AMAZONAS","LUYA","MARÍA","01","05","11"]
[null,"01 Amazonas","05 Luya","12 Ocalli","01","05","12","Amazonas","Luya","Ocalli","010512","AMAZONAS","LUYA","OCALLI","01","05","12"]
[null,"01 Amazonas","05 Luya","13 Ocumal","01","05","13","Amazonas","Luya","Ocumal","010513","AMAZONAS","LUYA","OCUMAL","01","05","13"]
[null,"01 Amazonas","05 Luya","14 Pisuquia","01","05","14","Amazonas","Luya","Pisuquia","010514","AMAZONAS","LUYA","PISUQUIA","01","05","14"]
[null,"01 Amazonas","05 Luya","15 Providencia","01","05","15","Amazonas","Luya","Providencia","010515","AMAZONAS","LUYA","PROVIDENCIA","01","05","15"]
[null,"01 Amazonas","05 Luya","16 San Cristóbal","01","05","16","Amazonas","Luya","San Cristóbal","010516","AMAZONAS","LUYA","SAN CRISTÓBAL","01","05","16"]
[null,"01 Amazonas","05 Luya","17 San Francisco de Yeso","01","05","17","Amazonas","Luya","San Francisco de Yeso","010517","AMAZONAS","LUYA","SAN FRANCISCO DE YESO","01","05","17"]
[null,"01 Amazonas","05 Luya","18 San Jerónimo","01","05","18","Amazonas","Luya","San Jerónimo","010518","AMAZONAS","LUYA","SAN JERÓNIMO","01","05","18"]
[null,"01 Amazonas","05 Luya","19 San Juan de Lopecancha","01","05","19","Amazonas","Luya","San Juan de Lopecancha","010519","AMAZONAS","LUYA","SAN JUAN DE LOPECANCHA","01","05","19"]
[null,"01 Amazonas","05 Luya","20 Santa Catalina","01","05","20","Amazonas","Luya","Santa Catalina","010520","AMAZONAS","LUYA","SANTA CATALINA","01","05","20"]
[null,"01 Amazonas","05 Luya","21 Santo Tomas","01","05","21","Amazonas","Luya","Santo Tomas","010521","AMAZONAS","LUYA","SANTO TOMAS","01","05","21"]
[null,"01 Amazonas","05 Luya","22 Tingo","01","05","22","Amazonas","Luya","Tingo","010522","AMAZONAS","LUYA","TINGO","01","05","22"]
[null,"01 Amazonas","05 Luya","23 Trita",{"$f":"+MID(B68,1,2)","v":"01"},"05","23","Amazonas","Luya","Trita",{"$f":"+CONCATENATE(E68,F68,G68)","v":"010523"},"AMAZONAS","LUYA","TRITA","01","05","23"]
[null,"01 Amazonas","06 Rodríguez de Mendoza","01 San Nicolás","01","06","01","Amazonas","Rodríguez de Mendoza","San Nicolás","010601","AMAZONAS","RODRÍGUEZ DE MENDOZA","SAN NICOLÁS","01","06","01"]
[null,"01 Amazonas","06 Rodríguez de Mendoza","02 Chirimoto","01","06","02","Amazonas","Rodríguez de Mendoza","Chirimoto","010602","AMAZONAS","RODRÍGUEZ DE MENDOZA","CHIRIMOTO","01","06","02"]
[null,"01 Amazonas","06 Rodríguez de Mendoza","03 Cochamal","01","06","03","Amazonas","Rodríguez de Mendoza","Cochamal","010603","AMAZONAS","RODRÍGUEZ DE MENDOZA","COCHAMAL","01","06","03"]
[null,"01 Amazonas","06 Rodríguez de Mendoza","04 Huambo","01","06","04","Amazonas","Rodríguez de Mendoza","Huambo","010604","AMAZONAS","RODRÍGUEZ DE MENDOZA","HUAMBO","01","06","04"]
[null,"01 Amazonas","06 Rodríguez de Mendoza","05 Limabamba","01","06","05","Amazonas","Rodríguez de Mendoza","Limabamba","010605","AMAZONAS","RODRÍGUEZ DE MENDOZA","LIMABAMBA","01","06","05"]
[null,"01 Amazonas","06 Rodríguez de Mendoza","06 Longar","01","06","06","Amazonas","Rodríguez de Mendoza","Longar","010606","AMAZONAS","RODRÍGUEZ DE MENDOZA","LONGAR","01","06","06"]
[null,"01 Amazonas","06 Rodríguez de Mendoza","07 Mariscal Benavides","01","06","07","Amazonas","Rodríguez de Mendoza","Mariscal Benavides","010607","AMAZONAS","RODRÍGUEZ DE MENDOZA","MARISCAL BENAVIDES","01","06","07"]
[null,"01 Amazonas","06 Rodríguez de Mendoza","08 Milpuc","01","06","08","Amazonas","Rodríguez de Mendoza","Milpuc","010608","AMAZONAS","RODRÍGUEZ DE MENDOZA","MILPUC","01","06","08"]
[null,"01 Amazonas","06 Rodríguez de Mendoza","09 Omia","01","06","09","Amazonas","Rodríguez de Mendoza","Omia","010609","AMAZONAS","RODRÍGUEZ DE MENDOZA","OMIA","01","06","09"]
[null,"01 Amazonas","06 Rodríguez de Mendoza","10 Santa Rosa","01","06","10","Amazonas","Rodríguez de Mendoza","Santa Rosa","010610","AMAZONAS","RODRÍGUEZ DE MENDOZA","SANTA ROSA","01","06","10"]
[null,"01 Amazonas","06 Rodríguez de Mendoza","11 Totora","01","06","11","Amazonas","Rodríguez de Mendoza","Totora","010611","AMAZONAS","RODRÍGUEZ DE MENDOZA","TOTORA","01","06","11"]
[null,"01 Amazonas","06 Rodríguez de Mendoza","12 Vista Alegre","01","06","12","Amazonas","Rodríguez de Mendoza","Vista Alegre","010612","AMAZONAS","RODRÍGUEZ DE MENDOZA","VISTA ALEGRE","01","06","12"]
[null,"01 Amazonas","07 Utcubamba","01 Bagua Grande","01","07","01","Amazonas","Utcubamba","Bagua Grande","010701","AMAZONAS","UTCUBAMBA","BAGUA GRANDE","01","07","01"]
[null,"01 Amazonas","07 Utcubamba","02 Cajaruro","01","07","02","Amazonas","Utcubamba","Cajaruro","010702","AMAZONAS","UTCUBAMBA","CAJARURO","01","07","02"]
[null,"01 Amazonas","07 Utcubamba","03 Cumba","01","07","03","Amazonas","Utcubamba","Cumba","010703","AMAZONAS","UTCUBAMBA","CUMBA","01","07","03"]
[null,"01 Amazonas","07 Utcubamba","04 El Milagro","01","07","04","Amazonas","Utcubamba","El Milagro","010704","AMAZONAS","UTCUBAMBA","EL MILAGRO","01","07","04"]
[null,"01 Amazonas","07 Utcubamba","05 Jamalca","01","07","05","Amazonas","Utcubamba","Jamalca","010705","AMAZONAS","UTCUBAMBA","JAMALCA","01","07","05"]
[null,"01 Amazonas","07 Utcubamba","06 Lonya Grande","01","07","06","Amazonas","Utcubamba","Lonya Grande","010706","AMAZONAS","UTCUBAMBA","LONYA GRANDE","01","07","06"]
[null,"01 Amazonas","07 Utcubamba","07 Yamon","01","07","07","Amazonas","Utcubamba","Yamon","010707","AMAZONAS","UTCUBAMBA","YAMON","01","07","07"]
[null,"02 Áncash","01 Huaraz","01 Huaraz","02","01","01","Áncash","Huaraz","Huaraz","020101","ÁNCASH","HUARAZ","HUARAZ","02","01","01"]
[null,"02 Áncash","01 Huaraz","02 Cochabamba","02","01","02","Áncash","Huaraz","Cochabamba","020102","ÁNCASH","HUARAZ","COCHABAMBA","02","01","02"]
[null,"02 Áncash","01 Huaraz","03 Colcabamba","02","01","03","Áncash","Huaraz","Colcabamba","020103","ÁNCASH","HUARAZ","COLCABAMBA","02","01","03"]
[null,"02 Áncash","01 Huaraz","04 Huanchay","02","01","04","Áncash","Huaraz","Huanchay","020104","ÁNCASH","HUARAZ","HUANCHAY","02","01","04"]
[null,"02 Áncash","01 Huaraz","05 Independencia","02","01","05","Áncash","Huaraz","Independencia","020105","ÁNCASH","HUARAZ","INDEPENDENCIA","02","01","05"]
[null,"02 Áncash","01 Huaraz","06 Jangas","02","01","06","Áncash","Huaraz","Jangas","020106","ÁNCASH","HUARAZ","JANGAS","02","01","06"]
[null,"02 Áncash","01 Huaraz","07 La Libertad","02","01","07","Áncash","Huaraz","La Libertad","020107","ÁNCASH","HUARAZ","LA LIBERTAD","02","01","07"]
[null,"02 Áncash","01 Huaraz","08 Olleros","02","01","08","Áncash","Huaraz","Olleros","020108","ÁNCASH","HUARAZ","OLLEROS","02","01","08"]
[null,"02 Áncash","01 Huaraz","09 Pampas Grande","02","01","09","Áncash","Huaraz","Pampas Grande","020109","ÁNCASH","HUARAZ","PAMPAS GRANDE","02","01","09"]
[null,"02 Áncash","01 Huaraz","10 Pariacoto","02","01","10","Áncash","Huaraz","Pariacoto","020110","ÁNCASH","HUARAZ","PARIACOTO","02","01","10"]
[null,"02 Áncash","01 Huaraz","11 Pira","02","01","11","Áncash","Huaraz","Pira","020111","ÁNCASH","HUARAZ","PIRA","02","01","11"]
[null,"02 Áncash","01 Huaraz","12 Tarica","02","01","12","Áncash","Huaraz","Tarica","020112","ÁNCASH","HUARAZ","TARICA","02","01","12"]
[null,"02 Áncash","02 Aija","01 Aija","02","02","01","Áncash","Aija","Aija","020201","ÁNCASH","AIJA","AIJA","02","02","01"]
[null,"02 Áncash","02 Aija","02 Coris","02","02","02","Áncash","Aija","Coris","020202","ÁNCASH","AIJA","CORIS","02","02","02"]
[null,"02 Áncash","02 Aija","03 Huacllan","02","02","03","Áncash","Aija","Huacllan","020203","ÁNCASH","AIJA","HUACLLAN","02","02","03"]
[null,"02 Áncash","02 Aija","04 La Merced","02","02","04","Áncash","Aija","La Merced","020204","ÁNCASH","AIJA","LA MERCED","02","02","04"]
[null,"02 Áncash","02 Aija","05 Succha","02","02","05","Áncash","Aija","Succha","020205","ÁNCASH","AIJA","SUCCHA","02","02","05"]
[null,"02 Áncash","03 Antonio Raymondi","01 Llamellin","02","03","01","Áncash","Antonio Raymondi","Llamellin","020301","ÁNCASH","ANTONIO RAYMONDI","LLAMELLIN","02","03","01"]
[null,"02 Áncash","03 Antonio Raymondi","02 Aczo","02","03","02","Áncash","Antonio Raymondi","Aczo","020302","ÁNCASH","ANTONIO RAYMONDI","ACZO","02","03","02"]
[null,"02 Áncash","03 Antonio Raymondi","03 Chaccho","02","03","03","Áncash","Antonio Raymondi","Chaccho","020303","ÁNCASH","ANTONIO RAYMONDI","CHACCHO","02","03","03"]
[null,"02 Áncash","03 Antonio Raymondi","04 Chingas","02","03","04","Áncash","Antonio Raymondi","Chingas","020304","ÁNCASH","ANTONIO RAYMONDI","CHINGAS","02","03","04"]
[null,"02 Áncash","03 Antonio Raymondi","05 Mirgas","02","03","05","Áncash","Antonio Raymondi","Mirgas","020305","ÁNCASH","ANTONIO RAYMONDI","MIRGAS","02","03","05"]
[null,"02 Áncash","03 Antonio Raymondi","06 San Juan de Rontoy","02","03","06","Áncash","Antonio Raymondi","San Juan de Rontoy","020306","ÁNCASH","ANTONIO RAYMONDI","SAN JUAN DE RONTOY","02","03","06"]
[null,"02 Áncash","04 Asunción","01 Chacas","02","04","01","Áncash","Asunción","Chacas","020401","ÁNCASH","ASUNCIÓN","CHACAS","02","04","01"]
[null,"02 Áncash","04 Asunción","02 Acochaca","02","04","02","Áncash","Asunción","Acochaca","020402","ÁNCASH","ASUNCIÓN","ACOCHACA","02","04","02"]
[null,"02 Áncash","05 Bolognesi","01 Chiquian","02","05","01","Áncash","Bolognesi","Chiquian","020501","ÁNCASH","BOLOGNESI","CHIQUIAN","02","05","01"]
[null,"02 Áncash","05 Bolognesi","02 Abelardo Pardo Lezameta","02","05","02","Áncash","Bolognesi","Abelardo Pardo Lezameta","020502","ÁNCASH","BOLOGNESI","ABELARDO PARDO LEZAMETA","02","05","02"]
[null,"02 Áncash","05 Bolognesi","03 Antonio Raymondi","02","05","03","Áncash","Bolognesi","Antonio Raymondi","020503","ÁNCASH","BOLOGNESI","ANTONIO RAYMONDI","02","05","03"]
[null,"02 Áncash","05 Bolognesi","04 Aquia","02","05","04","Áncash","Bolognesi","Aquia","020504","ÁNCASH","BOLOGNESI","AQUIA","02","05","04"]
[null,"02 Áncash","05 Bolognesi","05 Cajacay","02","05","05","Áncash","Bolognesi","Cajacay","020505","ÁNCASH","BOLOGNESI","CAJACAY","02","05","05"]
[null,"02 Áncash","05 Bolognesi","06 Canis","02","05","06","Áncash","Bolognesi","Canis","020506","ÁNCASH","BOLOGNESI","CANIS","02","05","06"]
[null,"02 Áncash","05 Bolognesi","07 Colquioc","02","05","07","Áncash","Bolognesi","Colquioc","020507","ÁNCASH","BOLOGNESI","COLQUIOC","02","05","07"]
[null,"02 Áncash","05 Bolognesi","08 Huallanca","02","05","08","Áncash","Bolognesi","Huallanca","020508","ÁNCASH","BOLOGNESI","HUALLANCA","02","05","08"]
[null,"02 Áncash","05 Bolognesi","09 Huasta","02","05","09","Áncash","Bolognesi","Huasta","020509","ÁNCASH","BOLOGNESI","HUASTA","02","05","09"]
[null,"02 Áncash","05 Bolognesi","10 Huayllacayan","02","05","10","Áncash","Bolognesi","Huayllacayan","020510","ÁNCASH","BOLOGNESI","HUAYLLACAYAN","02","05","10"]
[null,"02 Áncash","05 Bolognesi","11 La Primavera","02","05","11","Áncash","Bolognesi","La Primavera","020511","ÁNCASH","BOLOGNESI","LA PRIMAVERA","02","05","11"]
[null,"02 Áncash","05 Bolognesi","12 Mangas","02","05","12","Áncash","Bolognesi","Mangas","020512","ÁNCASH","BOLOGNESI","MANGAS","02","05","12"]
[null,"02 Áncash","05 Bolognesi","13 Pacllon","02","05","13","Áncash","Bolognesi","Pacllon","020513","ÁNCASH","BOLOGNESI","PACLLON","02","05","13"]
[null,"02 Áncash","05 Bolognesi","14 San Miguel de Corpanqui","02","05","14","Áncash","Bolognesi","San Miguel de Corpanqui","020514","ÁNCASH","BOLOGNESI","SAN MIGUEL DE CORPANQUI","02","05","14"]
[null,"02 Áncash","05 Bolognesi","15 Ticllos","02","05","15","Áncash","Bolognesi","Ticllos","020515","ÁNCASH","BOLOGNESI","TICLLOS","02","05","15"]
[null,"02 Áncash","06 Carhuaz","01 Carhuaz","02","06","01","Áncash","Carhuaz","Carhuaz","020601","ÁNCASH","CARHUAZ","CARHUAZ","02","06","01"]
[null,"02 Áncash","06 Carhuaz","02 Acopampa","02","06","02","Áncash","Carhuaz","Acopampa","020602","ÁNCASH","CARHUAZ","ACOPAMPA","02","06","02"]
[null,"02 Áncash","06 Carhuaz","03 Amashca","02","06","03","Áncash","Carhuaz","Amashca","020603","ÁNCASH","CARHUAZ","AMASHCA","02","06","03"]
[null,"02 Áncash","06 Carhuaz","04 Anta","02","06","04","Áncash","Carhuaz","Anta","020604","ÁNCASH","CARHUAZ","ANTA","02","06","04"]
[null,"02 Áncash","06 Carhuaz","05 Ataquero",{"$f":"+MID(B132,1,2)","v":"02"},"06","05","Áncash","Carhuaz","Ataquero",{"$f":"+CONCATENATE(E132,F132,G132)","v":"020605"},"ÁNCASH","CARHUAZ","ATAQUERO","02","06","05"]
[null,"02 Áncash","06 Carhuaz","06 Marcara","02","06","06","Áncash","Carhuaz","Marcara","020606","ÁNCASH","CARHUAZ","MARCARA","02","06","06"]
[null,"02 Áncash","06 Carhuaz","07 Pariahuanca","02","06","07","Áncash","Carhuaz","Pariahuanca","020607","ÁNCASH","CARHUAZ","PARIAHUANCA","02","06","07"]
[null,"02 Áncash","06 Carhuaz","08 San Miguel de Aco","02","06","08","Áncash","Carhuaz","San Miguel de Aco","020608","ÁNCASH","CARHUAZ","SAN MIGUEL DE ACO","02","06","08"]
[null,"02 Áncash","06 Carhuaz","09 Shilla","02","06","09","Áncash","Carhuaz","Shilla","020609","ÁNCASH","CARHUAZ","SHILLA","02","06","09"]
[null,"02 Áncash","06 Carhuaz","10 Tinco","02","06","10","Áncash","Carhuaz","Tinco","020610","ÁNCASH","CARHUAZ","TINCO","02","06","10"]
[null,"02 Áncash","06 Carhuaz","11 Yungar","02","06","11","Áncash","Carhuaz","Yungar","020611","ÁNCASH","CARHUAZ","YUNGAR","02","06","11"]
[null,"02 Áncash","07 Carlos Fermín Fitzcarrald","01 San Luis","02","07","01","Áncash","Carlos Fermín Fitzcarrald","San Luis","020701","ÁNCASH","CARLOS FERMÍN FITZCARRALD","SAN LUIS","02","07","01"]
[null,"02 Áncash","07 Carlos Fermín Fitzcarrald","02 San Nicolás","02","07","02","Áncash","Carlos Fermín Fitzcarrald","San Nicolás","020702","ÁNCASH","CARLOS FERMÍN FITZCARRALD","SAN NICOLÁS","02","07","02"]
[null,"02 Áncash","07 Carlos Fermín Fitzcarrald","03 Yauya","02","07","03","Áncash","Carlos Fermín Fitzcarrald","Yauya","020703","ÁNCASH","CARLOS FERMÍN FITZCARRALD","YAUYA","02","07","03"]
[null,"02 Áncash","08 Casma","01 Casma","02","08","01","Áncash","Casma","Casma","020801","ÁNCASH","CASMA","CASMA","02","08","01"]
[null,"02 Áncash","08 Casma","02 Buena Vista Alta","02","08","02","Áncash","Casma","Buena Vista Alta","020802","ÁNCASH","CASMA","BUENA VISTA ALTA","02","08","02"]
[null,"02 Áncash","08 Casma","03 Comandante Noel","02","08","03","Áncash","Casma","Comandante Noel","020803","ÁNCASH","CASMA","COMANDANTE NOEL","02","08","03"]
[null,"02 Áncash","08 Casma","04 Yautan","02","08","04","Áncash","Casma","Yautan","020804","ÁNCASH","CASMA","YAUTAN","02","08","04"]
[null,"02 Áncash","09 Corongo","01 Corongo","02","09","01","Áncash","Corongo","Corongo","020901","ÁNCASH","CORONGO","CORONGO","02","09","01"]
[null,"02 Áncash","09 Corongo","02 Aco","02","09","02","Áncash","Corongo","Aco","020902","ÁNCASH","CORONGO","ACO","02","09","02"]
[null,"02 Áncash","09 Corongo","03 Bambas","02","09","03","Áncash","Corongo","Bambas","020903","ÁNCASH","CORONGO","BAMBAS","02","09","03"]
[null,"02 Áncash","09 Corongo","04 Cusca","02","09","04","Áncash","Corongo","Cusca","020904","ÁNCASH","CORONGO","CUSCA","02","09","04"]
[null,"02 Áncash","09 Corongo","05 La Pampa","02","09","05","Áncash","Corongo","La Pampa","020905","ÁNCASH","CORONGO","LA PAMPA","02","09","05"]
[null,"02 Áncash","09 Corongo","06 Yanac","02","09","06","Áncash","Corongo","Yanac","020906","ÁNCASH","CORONGO","YANAC","02","09","06"]
[null,"02 Áncash","09 Corongo","07 Yupan","02","09","07","Áncash","Corongo","Yupan","020907","ÁNCASH","CORONGO","YUPAN","02","09","07"]
[null,"02 Áncash","10 Huari","01 Huari","02","10","01","Áncash","Huari","Huari","021001","ÁNCASH","HUARI","HUARI","02","10","01"]
[null,"02 Áncash","10 Huari","02 Anra","02","10","02","Áncash","Huari","Anra","021002","ÁNCASH","HUARI","ANRA","02","10","02"]
[null,"02 Áncash","10 Huari","03 Cajay","02","10","03","Áncash","Huari","Cajay","021003","ÁNCASH","HUARI","CAJAY","02","10","03"]
[null,"02 Áncash","10 Huari","04 Chavin de Huantar","02","10","04","Áncash","Huari","Chavin de Huantar","021004","ÁNCASH","HUARI","CHAVIN DE HUANTAR","02","10","04"]
[null,"02 Áncash","10 Huari","05 Huacachi","02","10","05","Áncash","Huari","Huacachi","021005","ÁNCASH","HUARI","HUACACHI","02","10","05"]
[null,"02 Áncash","10 Huari","06 Huacchis","02","10","06","Áncash","Huari","Huacchis","021006","ÁNCASH","HUARI","HUACCHIS","02","10","06"]
[null,"02 Áncash","10 Huari","07 Huachis","02","10","07","Áncash","Huari","Huachis","021007","ÁNCASH","HUARI","HUACHIS","02","10","07"]
[null,"02 Áncash","10 Huari","08 Huantar","02","10","08","Áncash","Huari","Huantar","021008","ÁNCASH","HUARI","HUANTAR","02","10","08"]
[null,"02 Áncash","10 Huari","09 Masin","02","10","09","Áncash","Huari","Masin","021009","ÁNCASH","HUARI","MASIN","02","10","09"]
[null,"02 Áncash","10 Huari","10 Paucas","02","10","10","Áncash","Huari","Paucas","021010","ÁNCASH","HUARI","PAUCAS","02","10","10"]
[null,"02 Áncash","10 Huari","11 Ponto","02","10","11","Áncash","Huari","Ponto","021011","ÁNCASH","HUARI","PONTO","02","10","11"]
[null,"02 Áncash","10 Huari","12 Rahuapampa","02","10","12","Áncash","Huari","Rahuapampa","021012","ÁNCASH","HUARI","RAHUAPAMPA","02","10","12"]
[null,"02 Áncash","10 Huari","13 Rapayan","02","10","13","Áncash","Huari","Rapayan","021013","ÁNCASH","HUARI","RAPAYAN","02","10","13"]
[null,"02 Áncash","10 Huari","14 San Marcos","02","10","14","Áncash","Huari","San Marcos","021014","ÁNCASH","HUARI","SAN MARCOS","02","10","14"]
[null,"02 Áncash","10 Huari","15 San Pedro de Chana","02","10","15","Áncash","Huari","San Pedro de Chana","021015","ÁNCASH","HUARI","SAN PEDRO DE CHANA","02","10","15"]
[null,"02 Áncash","10 Huari","16 Uco","02","10","16","Áncash","Huari","Uco","021016","ÁNCASH","HUARI","UCO","02","10","16"]
[null,"02 Áncash","11 Huarmey","01 Huarmey","02","11","01","Áncash","Huarmey","Huarmey","021101","ÁNCASH","HUARMEY","HUARMEY","02","11","01"]
[null,"02 Áncash","11 Huarmey","02 Cochapeti","02","11","02","Áncash","Huarmey","Cochapeti","021102","ÁNCASH","HUARMEY","COCHAPETI","02","11","02"]
[null,"02 Áncash","11 Huarmey","03 Culebras","02","11","03","Áncash","Huarmey","Culebras","021103","ÁNCASH","HUARMEY","CULEBRAS","02","11","03"]
[null,"02 Áncash","11 Huarmey","04 Huayan","02","11","04","Áncash","Huarmey","Huayan","021104","ÁNCASH","HUARMEY","HUAYAN","02","11","04"]
[null,"02 Áncash","11 Huarmey","05 Malvas","02","11","05","Áncash","Huarmey","Malvas","021105","ÁNCASH","HUARMEY","MALVAS","02","11","05"]
[null,"02 Áncash","12 Huaylas","01 Caraz","02","12","01","Áncash","Huaylas","Caraz","021201","ÁNCASH","HUAYLAS","CARAZ","02","12","01"]
[null,"02 Áncash","12 Huaylas","02 Huallanca","02","12","02","Áncash","Huaylas","Huallanca","021202","ÁNCASH","HUAYLAS","HUALLANCA","02","12","02"]
[null,"02 Áncash","12 Huaylas","03 Huata","02","12","03","Áncash","Huaylas","Huata","021203","ÁNCASH","HUAYLAS","HUATA","02","12","03"]
[null,"02 Áncash","12 Huaylas","04 Huaylas","02","12","04","Áncash","Huaylas","Huaylas","021204","ÁNCASH","HUAYLAS","HUAYLAS","02","12","04"]
[null,"02 Áncash","12 Huaylas","05 Mato","02","12","05","Áncash","Huaylas","Mato","021205","ÁNCASH","HUAYLAS","MATO","02","12","05"]
[null,"02 Áncash","12 Huaylas","06 Pamparomas","02","12","06","Áncash","Huaylas","Pamparomas","021206","ÁNCASH","HUAYLAS","PAMPAROMAS","02","12","06"]
[null,"02 Áncash","12 Huaylas","07 Pueblo Libre","02","12","07","Áncash","Huaylas","Pueblo Libre","021207","ÁNCASH","HUAYLAS","PUEBLO LIBRE","02","12","07"]
[null,"02 Áncash","12 Huaylas","08 Santa Cruz","02","12","08","Áncash","Huaylas","Santa Cruz","021208","ÁNCASH","HUAYLAS","SANTA CRUZ","02","12","08"]
[null,"02 Áncash","12 Huaylas","09 Santo Toribio","02","12","09","Áncash","Huaylas","Santo Toribio","021209","ÁNCASH","HUAYLAS","SANTO TORIBIO","02","12","09"]
[null,"02 Áncash","12 Huaylas","10 Yuracmarca","02","12","10","Áncash","Huaylas","Yuracmarca","021210","ÁNCASH","HUAYLAS","YURACMARCA","02","12","10"]
[null,"02 Áncash","13 Mariscal Luzuriaga","01 Piscobamba","02","13","01","Áncash","Mariscal Luzuriaga","Piscobamba","021301","ÁNCASH","MARISCAL LUZURIAGA","PISCOBAMBA","02","13","01"]
[null,"02 Áncash","13 Mariscal Luzuriaga","02 Casca","02","13","02","Áncash","Mariscal Luzuriaga","Casca","021302","ÁNCASH","MARISCAL LUZURIAGA","CASCA","02","13","02"]
[null,"02 Áncash","13 Mariscal Luzuriaga","03 Eleazar Guzmán Barron","02","13","03","Áncash","Mariscal Luzuriaga","Eleazar Guzmán Barron","021303","ÁNCASH","MARISCAL LUZURIAGA","ELEAZAR GUZMÁN BARRON","02","13","03"]
[null,"02 Áncash","13 Mariscal Luzuriaga","04 Fidel Olivas Escudero","02","13","04","Áncash","Mariscal Luzuriaga","Fidel Olivas Escudero","021304","ÁNCASH","MARISCAL LUZURIAGA","FIDEL OLIVAS ESCUDERO","02","13","04"]
[null,"02 Áncash","13 Mariscal Luzuriaga","05 Llama","02","13","05","Áncash","Mariscal Luzuriaga","Llama","021305","ÁNCASH","MARISCAL LUZURIAGA","LLAMA","02","13","05"]
[null,"02 Áncash","13 Mariscal Luzuriaga","06 Llumpa","02","13","06","Áncash","Mariscal Luzuriaga","Llumpa","021306","ÁNCASH","MARISCAL LUZURIAGA","LLUMPA","02","13","06"]
[null,"02 Áncash","13 Mariscal Luzuriaga","07 Lucma","02","13","07","Áncash","Mariscal Luzuriaga","Lucma","021307","ÁNCASH","MARISCAL LUZURIAGA","LUCMA","02","13","07"]
[null,"02 Áncash","13 Mariscal Luzuriaga","08 Musga","02","13","08","Áncash","Mariscal Luzuriaga","Musga","021308","ÁNCASH","MARISCAL LUZURIAGA","MUSGA","02","13","08"]
[null,"02 Áncash","14 Ocros","01 Ocros","02","14","01","Áncash","Ocros","Ocros","021401","ÁNCASH","OCROS","OCROS","02","14","01"]
[null,"02 Áncash","14 Ocros","02 Acas","02","14","02","Áncash","Ocros","Acas","021402","ÁNCASH","OCROS","ACAS","02","14","02"]
[null,"02 Áncash","14 Ocros","03 Cajamarquilla","02","14","03","Áncash","Ocros","Cajamarquilla","021403","ÁNCASH","OCROS","CAJAMARQUILLA","02","14","03"]
[null,"02 Áncash","14 Ocros","04 Carhuapampa","02","14","04","Áncash","Ocros","Carhuapampa","021404","ÁNCASH","OCROS","CARHUAPAMPA","02","14","04"]
[null,"02 Áncash","14 Ocros","05 Cochas",{"$f":"+MID(B196,1,2)","v":"02"},"14","05","Áncash","Ocros","Cochas",{"$f":"+CONCATENATE(E196,F196,G196)","v":"021405"},"ÁNCASH","OCROS","COCHAS","02","14","05"]
[null,"02 Áncash","14 Ocros","06 Congas","02","14","06","Áncash","Ocros","Congas","021406","ÁNCASH","OCROS","CONGAS","02","14","06"]
[null,"02 Áncash","14 Ocros","07 Llipa","02","14","07","Áncash","Ocros","Llipa","021407","ÁNCASH","OCROS","LLIPA","02","14","07"]
[null,"02 Áncash","14 Ocros","08 San Cristóbal de Rajan","02","14","08","Áncash","Ocros","San Cristóbal de Rajan","021408","ÁNCASH","OCROS","SAN CRISTÓBAL DE RAJAN","02","14","08"]
[null,"02 Áncash","14 Ocros","09 San Pedro","02","14","09","Áncash","Ocros","San Pedro","021409","ÁNCASH","OCROS","SAN PEDRO","02","14","09"]
[null,"02 Áncash","14 Ocros","10 Santiago de Chilcas","02","14","10","Áncash","Ocros","Santiago de Chilcas","021410","ÁNCASH","OCROS","SANTIAGO DE CHILCAS","02","14","10"]
[null,"02 Áncash","15 Pallasca","01 Cabana","02","15","01","Áncash","Pallasca","Cabana","021501","ÁNCASH","PALLASCA","CABANA","02","15","01"]
[null,"02 Áncash","15 Pallasca","02 Bolognesi","02","15","02","Áncash","Pallasca","Bolognesi","021502","ÁNCASH","PALLASCA","BOLOGNESI","02","15","02"]
[null,"02 Áncash","15 Pallasca","03 Conchucos","02","15","03","Áncash","Pallasca","Conchucos","021503","ÁNCASH","PALLASCA","CONCHUCOS","02","15","03"]
[null,"02 Áncash","15 Pallasca","04 Huacaschuque","02","15","04","Áncash","Pallasca","Huacaschuque","021504","ÁNCASH","PALLASCA","HUACASCHUQUE","02","15","04"]
[null,"02 Áncash","15 Pallasca","05 Huandoval","02","15","05","Áncash","Pallasca","Huandoval","021505","ÁNCASH","PALLASCA","HUANDOVAL","02","15","05"]
[null,"02 Áncash","15 Pallasca","06 Lacabamba","02","15","06","Áncash","Pallasca","Lacabamba","021506","ÁNCASH","PALLASCA","LACABAMBA","02","15","06"]
[null,"02 Áncash","15 Pallasca","07 Llapo","02","15","07","Áncash","Pallasca","Llapo","021507","ÁNCASH","PALLASCA","LLAPO","02","15","07"]
[null,"02 Áncash","15 Pallasca","08 Pallasca","02","15","08","Áncash","Pallasca","Pallasca","021508","ÁNCASH","PALLASCA","PALLASCA","02","15","08"]
[null,"02 Áncash","15 Pallasca","09 Pampas","02","15","09","Áncash","Pallasca","Pampas","021509","ÁNCASH","PALLASCA","PAMPAS","02","15","09"]
[null,"02 Áncash","15 Pallasca","10 Santa Rosa","02","15","10","Áncash","Pallasca","Santa Rosa","021510","ÁNCASH","PALLASCA","SANTA ROSA","02","15","10"]
[null,"02 Áncash","15 Pallasca","11 Tauca","02","15","11","Áncash","Pallasca","Tauca","021511","ÁNCASH","PALLASCA","TAUCA","02","15","11"]
[null,"02 Áncash","16 Pomabamba","01 Pomabamba","02","16","01","Áncash","Pomabamba","Pomabamba","021601","ÁNCASH","POMABAMBA","POMABAMBA","02","16","01"]
[null,"02 Áncash","16 Pomabamba","02 Huayllan","02","16","02","Áncash","Pomabamba","Huayllan","021602","ÁNCASH","POMABAMBA","HUAYLLAN","02","16","02"]
[null,"02 Áncash","16 Pomabamba","03 Parobamba","02","16","03","Áncash","Pomabamba","Parobamba","021603","ÁNCASH","POMABAMBA","PAROBAMBA","02","16","03"]
[null,"02 Áncash","16 Pomabamba","04 Quinuabamba","02","16","04","Áncash","Pomabamba","Quinuabamba","021604","ÁNCASH","POMABAMBA","QUINUABAMBA","02","16","04"]
[null,"02 Áncash","17 Recuay","01 Recuay","02","17","01","Áncash","Recuay","Recuay","021701","ÁNCASH","RECUAY","RECUAY","02","17","01"]
[null,"02 Áncash","17 Recuay","02 Catac","02","17","02","Áncash","Recuay","Catac","021702","ÁNCASH","RECUAY","CATAC","02","17","02"]
[null,"02 Áncash","17 Recuay","03 Cotaparaco","02","17","03","Áncash","Recuay","Cotaparaco","021703","ÁNCASH","RECUAY","COTAPARACO","02","17","03"]
[null,"02 Áncash","17 Recuay","04 Huayllapampa","02","17","04","Áncash","Recuay","Huayllapampa","021704","ÁNCASH","RECUAY","HUAYLLAPAMPA","02","17","04"]
[null,"02 Áncash","17 Recuay","05 Llacllin","02","17","05","Áncash","Recuay","Llacllin","021705","ÁNCASH","RECUAY","LLACLLIN","02","17","05"]
[null,"02 Áncash","17 Recuay","06 Marca","02","17","06","Áncash","Recuay","Marca","021706","ÁNCASH","RECUAY","MARCA","02","17","06"]
[null,"02 Áncash","17 Recuay","07 Pampas Chico","02","17","07","Áncash","Recuay","Pampas Chico","021707","ÁNCASH","RECUAY","PAMPAS CHICO","02","17","07"]
[null,"02 Áncash","17 Recuay","08 Pararin","02","17","08","Áncash","Recuay","Pararin","021708","ÁNCASH","RECUAY","PARARIN","02","17","08"]
[null,"02 Áncash","17 Recuay","09 Tapacocha","02","17","09","Áncash","Recuay","Tapacocha","021709","ÁNCASH","RECUAY","TAPACOCHA","02","17","09"]
[null,"02 Áncash","17 Recuay","10 Ticapampa","02","17","10","Áncash","Recuay","Ticapampa","021710","ÁNCASH","RECUAY","TICAPAMPA","02","17","10"]
[null,"02 Áncash","18 Santa","01 Chimbote","02","18","01","Áncash","Santa","Chimbote","021801","ÁNCASH","SANTA","CHIMBOTE","02","18","01"]
[null,"02 Áncash","18 Santa","02 Cáceres del Perú","02","18","02","Áncash","Santa","Cáceres del Perú","021802","ÁNCASH","SANTA","CÁCERES DEL PERÚ","02","18","02"]
[null,"02 Áncash","18 Santa","03 Coishco","02","18","03","Áncash","Santa","Coishco","021803","ÁNCASH","SANTA","COISHCO","02","18","03"]
[null,"02 Áncash","18 Santa","04 Macate","02","18","04","Áncash","Santa","Macate","021804","ÁNCASH","SANTA","MACATE","02","18","04"]
[null,"02 Áncash","18 Santa","05 Moro","02","18","05","Áncash","Santa","Moro","021805","ÁNCASH","SANTA","MORO","02","18","05"]
[null,"02 Áncash","18 Santa","06 Nepeña","02","18","06","Áncash","Santa","Nepeña","021806","ÁNCASH","SANTA","NEPEÑA","02","18","06"]
[null,"02 Áncash","18 Santa","07 Samanco","02","18","07","Áncash","Santa","Samanco","021807","ÁNCASH","SANTA","SAMANCO","02","18","07"]
[null,"02 Áncash","18 Santa","08 Santa","02","18","08","Áncash","Santa","Santa","021808","ÁNCASH","SANTA","SANTA","02","18","08"]
[null,"02 Áncash","18 Santa","09 Nuevo Chimbote","02","18","09","Áncash","Santa","Nuevo Chimbote","021809","ÁNCASH","SANTA","NUEVO CHIMBOTE","02","18","09"]
[null,"02 Áncash","19 Sihuas","01 Sihuas","02","19","01","Áncash","Sihuas","Sihuas","021901","ÁNCASH","SIHUAS","SIHUAS","02","19","01"]
[null,"02 Áncash","19 Sihuas","02 Acobamba","02","19","02","Áncash","Sihuas","Acobamba","021902","ÁNCASH","SIHUAS","ACOBAMBA","02","19","02"]
[null,"02 Áncash","19 Sihuas","03 Alfonso Ugarte","02","19","03","Áncash","Sihuas","Alfonso Ugarte","021903","ÁNCASH","SIHUAS","ALFONSO UGARTE","02","19","03"]
[null,"02 Áncash","19 Sihuas","04 Cashapampa","02","19","04","Áncash","Sihuas","Cashapampa","021904","ÁNCASH","SIHUAS","CASHAPAMPA","02","19","04"]
[null,"02 Áncash","19 Sihuas","05 Chingalpo","02","19","05","Áncash","Sihuas","Chingalpo","021905","ÁNCASH","SIHUAS","CHINGALPO","02","19","05"]
[null,"02 Áncash","19 Sihuas","06 Huayllabamba","02","19","06","Áncash","Sihuas","Huayllabamba","021906","ÁNCASH","SIHUAS","HUAYLLABAMBA","02","19","06"]
[null,"02 Áncash","19 Sihuas","07 Quiches","02","19","07","Áncash","Sihuas","Quiches","021907","ÁNCASH","SIHUAS","QUICHES","02","19","07"]
[null,"02 Áncash","19 Sihuas","08 Ragash","02","19","08","Áncash","Sihuas","Ragash","021908","ÁNCASH","SIHUAS","RAGASH","02","19","08"]
[null,"02 Áncash","19 Sihuas","09 San Juan","02","19","09","Áncash","Sihuas","San Juan","021909","ÁNCASH","SIHUAS","SAN JUAN","02","19","09"]
[null,"02 Áncash","19 Sihuas","10 Sicsibamba","02","19","10","Áncash","Sihuas","Sicsibamba","021910","ÁNCASH","SIHUAS","SICSIBAMBA","02","19","10"]
[null,"02 Áncash","20 Yungay","01 Yungay","02","20","01","Áncash","Yungay","Yungay","022001","ÁNCASH","YUNGAY","YUNGAY","02","20","01"]
[null,"02 Áncash","20 Yungay","02 Cascapara","02","20","02","Áncash","Yungay","Cascapara","022002","ÁNCASH","YUNGAY","CASCAPARA","02","20","02"]
[null,"02 Áncash","20 Yungay","03 Mancos","02","20","03","Áncash","Yungay","Mancos","022003","ÁNCASH","YUNGAY","MANCOS","02","20","03"]
[null,"02 Áncash","20 Yungay","04 Matacoto","02","20","04","Áncash","Yungay","Matacoto","022004","ÁNCASH","YUNGAY","MATACOTO","02","20","04"]
[null,"02 Áncash","20 Yungay","05 Quillo","02","20","05","Áncash","Yungay","Quillo","022005","ÁNCASH","YUNGAY","QUILLO","02","20","05"]
[null,"02 Áncash","20 Yungay","06 Ranrahirca","02","20","06","Áncash","Yungay","Ranrahirca","022006","ÁNCASH","YUNGAY","RANRAHIRCA","02","20","06"]
[null,"02 Áncash","20 Yungay","07 Shupluy","02","20","07","Áncash","Yungay","Shupluy","022007","ÁNCASH","YUNGAY","SHUPLUY","02","20","07"]
[null,"02 Áncash","20 Yungay","08 Yanama","02","20","08","Áncash","Yungay","Yanama","022008","ÁNCASH","YUNGAY","YANAMA","02","20","08"]
[null,"03 Apurímac","01 Abancay","01 Abancay","03","01","01","Apurímac","Abancay","Abancay","030101","APURÍMAC","ABANCAY","ABANCAY","03","01","01"]
[null,"03 Apurímac","01 Abancay","02 Chacoche","03","01","02","Apurímac","Abancay","Chacoche","030102","APURÍMAC","ABANCAY","CHACOCHE","03","01","02"]
[null,"03 Apurímac","01 Abancay","03 Circa","03","01","03","Apurímac","Abancay","Circa","030103","APURÍMAC","ABANCAY","CIRCA","03","01","03"]
[null,"03 Apurímac","01 Abancay","04 Curahuasi","03","01","04","Apurímac","Abancay","Curahuasi","030104","APURÍMAC","ABANCAY","CURAHUASI","03","01","04"]
[null,"03 Apurímac","01 Abancay","05 Huanipaca","03","01","05","Apurímac","Abancay","Huanipaca","030105","APURÍMAC","ABANCAY","HUANIPACA","03","01","05"]
[null,"03 Apurímac","01 Abancay","06 Lambrama","03","01","06","Apurímac","Abancay","Lambrama","030106","APURÍMAC","ABANCAY","LAMBRAMA","03","01","06"]
[null,"03 Apurímac","01 Abancay","07 Pichirhua",{"$f":"+MID(B260,1,2)","v":"03"},"01","07","Apurímac","Abancay","Pichirhua",{"$f":"+CONCATENATE(E260,F260,G260)","v":"030107"},"APURÍMAC","ABANCAY","PICHIRHUA","03","01","07"]
[null,"03 Apurímac","01 Abancay","08 San Pedro de Cachora","03","01","08","Apurímac","Abancay","San Pedro de Cachora","030108","APURÍMAC","ABANCAY","SAN PEDRO DE CACHORA","03","01","08"]
[null,"03 Apurímac","01 Abancay","09 Tamburco","03","01","09","Apurímac","Abancay","Tamburco","030109","APURÍMAC","ABANCAY","TAMBURCO","03","01","09"]
[null,"03 Apurímac","02 Andahuaylas","01 Andahuaylas","03","02","01","Apurímac","Andahuaylas","Andahuaylas","030201","APURÍMAC","ANDAHUAYLAS","ANDAHUAYLAS","03","02","01"]
[null,"03 Apurímac","02 Andahuaylas","02 Andarapa","03","02","02","Apurímac","Andahuaylas","Andarapa","030202","APURÍMAC","ANDAHUAYLAS","ANDARAPA","03","02","02"]
[null,"03 Apurímac","02 Andahuaylas","03 Chiara","03","02","03","Apurímac","Andahuaylas","Chiara","030203","APURÍMAC","ANDAHUAYLAS","CHIARA","03","02","03"]
[null,"03 Apurímac","02 Andahuaylas","04 Huancarama","03","02","04","Apurímac","Andahuaylas","Huancarama","030204","APURÍMAC","ANDAHUAYLAS","HUANCARAMA","03","02","04"]
[null,"03 Apurímac","02 Andahuaylas","05 Huancaray","03","02","05","Apurímac","Andahuaylas","Huancaray","030205","APURÍMAC","ANDAHUAYLAS","HUANCARAY","03","02","05"]
[null,"03 Apurímac","02 Andahuaylas","06 Huayana","03","02","06","Apurímac","Andahuaylas","Huayana","030206","APURÍMAC","ANDAHUAYLAS","HUAYANA","03","02","06"]
[null,"03 Apurímac","02 Andahuaylas","07 Kishuara","03","02","07","Apurímac","Andahuaylas","Kishuara","030207","APURÍMAC","ANDAHUAYLAS","KISHUARA","03","02","07"]
[null,"03 Apurímac","02 Andahuaylas","08 Pacobamba","03","02","08","Apurímac","Andahuaylas","Pacobamba","030208","APURÍMAC","ANDAHUAYLAS","PACOBAMBA","03","02","08"]
[null,"03 Apurímac","02 Andahuaylas","09 Pacucha","03","02","09","Apurímac","Andahuaylas","Pacucha","030209","APURÍMAC","ANDAHUAYLAS","PACUCHA","03","02","09"]
[null,"03 Apurímac","02 Andahuaylas","10 Pampachiri","03","02","10","Apurímac","Andahuaylas","Pampachiri","030210","APURÍMAC","ANDAHUAYLAS","PAMPACHIRI","03","02","10"]
[null,"03 Apurímac","02 Andahuaylas","11 Pomacocha","03","02","11","Apurímac","Andahuaylas","Pomacocha","030211","APURÍMAC","ANDAHUAYLAS","POMACOCHA","03","02","11"]
[null,"03 Apurímac","02 Andahuaylas","12 San Antonio de Cachi","03","02","12","Apurímac","Andahuaylas","San Antonio de Cachi","030212","APURÍMAC","ANDAHUAYLAS","SAN ANTONIO DE CACHI","03","02","12"]
[null,"03 Apurímac","02 Andahuaylas","13 San Jerónimo","03","02","13","Apurímac","Andahuaylas","San Jerónimo","030213","APURÍMAC","ANDAHUAYLAS","SAN JERÓNIMO","03","02","13"]
[null,"03 Apurímac","02 Andahuaylas","14 San Miguel de Chaccrampa","03","02","14","Apurímac","Andahuaylas","San Miguel de Chaccrampa","030214","APURÍMAC","ANDAHUAYLAS","SAN MIGUEL DE CHACCRAMPA","03","02","14"]
[null,"03 Apurímac","02 Andahuaylas","15 Santa María de Chicmo","03","02","15","Apurímac","Andahuaylas","Santa María de Chicmo","030215","APURÍMAC","ANDAHUAYLAS","SANTA MARÍA DE CHICMO","03","02","15"]
[null,"03 Apurímac","02 Andahuaylas","16 Talavera","03","02","16","Apurímac","Andahuaylas","Talavera","030216","APURÍMAC","ANDAHUAYLAS","TALAVERA","03","02","16"]
[null,"03 Apurímac","02 Andahuaylas","17 Tumay Huaraca","03","02","17","Apurímac","Andahuaylas","Tumay Huaraca","030217","APURÍMAC","ANDAHUAYLAS","TUMAY HUARACA","03","02","17"]
[null,"03 Apurímac","02 Andahuaylas","18 Turpo","03","02","18","Apurímac","Andahuaylas","Turpo","030218","APURÍMAC","ANDAHUAYLAS","TURPO","03","02","18"]
[null,"03 Apurímac","02 Andahuaylas","19 Kaquiabamba","03","02","19","Apurímac","Andahuaylas","Kaquiabamba","030219","APURÍMAC","ANDAHUAYLAS","KAQUIABAMBA","03","02","19"]
[null,"03 Apurímac","02 Andahuaylas","20 José María Arguedas","03","02","20","Apurímac","Andahuaylas","José María Arguedas","030220","APURÍMAC","ANDAHUAYLAS","JOSÉ MARÍA ARGUEDAS","03","02","20"]
[null,"03 Apurímac","03 Antabamba","01 Antabamba","03","03","01","Apurímac","Antabamba","Antabamba","030301","APURÍMAC","ANTABAMBA","ANTABAMBA","03","03","01"]
[null,"03 Apurímac","03 Antabamba","02 El Oro","03","03","02","Apurímac","Antabamba","El Oro","030302","APURÍMAC","ANTABAMBA","EL ORO","03","03","02"]
[null,"03 Apurímac","03 Antabamba","03 Huaquirca","03","03","03","Apurímac","Antabamba","Huaquirca","030303","APURÍMAC","ANTABAMBA","HUAQUIRCA","03","03","03"]
[null,"03 Apurímac","03 Antabamba","04 Juan Espinoza Medrano","03","03","04","Apurímac","Antabamba","Juan Espinoza Medrano","030304","APURÍMAC","ANTABAMBA","JUAN ESPINOZA MEDRANO","03","03","04"]
[null,"03 Apurímac","03 Antabamba","05 Oropesa","03","03","05","Apurímac","Antabamba","Oropesa","030305","APURÍMAC","ANTABAMBA","OROPESA","03","03","05"]
[null,"03 Apurímac","03 Antabamba","06 Pachaconas","03","03","06","Apurímac","Antabamba","Pachaconas","030306","APURÍMAC","ANTABAMBA","PACHACONAS","03","03","06"]
[null,"03 Apurímac","03 Antabamba","07 Sabaino","03","03","07","Apurímac","Antabamba","Sabaino","030307","APURÍMAC","ANTABAMBA","SABAINO","03","03","07"]
[null,"03 Apurímac","04 Aymaraes","01 Chalhuanca","03","04","01","Apurímac","Aymaraes","Chalhuanca","030401","APURÍMAC","AYMARAES","CHALHUANCA","03","04","01"]
[null,"03 Apurímac","04 Aymaraes","02 Capaya","03","04","02","Apurímac","Aymaraes","Capaya","030402","APURÍMAC","AYMARAES","CAPAYA","03","04","02"]
[null,"03 Apurímac","04 Aymaraes","03 Caraybamba","03","04","03","Apurímac","Aymaraes","Caraybamba","030403","APURÍMAC","AYMARAES","CARAYBAMBA","03","04","03"]
[null,"03 Apurímac","04 Aymaraes","04 Chapimarca","03","04","04","Apurímac","Aymaraes","Chapimarca","030404","APURÍMAC","AYMARAES","CHAPIMARCA","03","04","04"]
[null,"03 Apurímac","04 Aymaraes","05 Colcabamba","03","04","05","Apurímac","Aymaraes","Colcabamba","030405","APURÍMAC","AYMARAES","COLCABAMBA","03","04","05"]
[null,"03 Apurímac","04 Aymaraes","06 Cotaruse","03","04","06","Apurímac","Aymaraes","Cotaruse","030406","APURÍMAC","AYMARAES","COTARUSE","03","04","06"]
[null,"03 Apurímac","04 Aymaraes","07 Ihuayllo","03","04","07","Apurímac","Aymaraes","Ihuayllo","030407","APURÍMAC","AYMARAES","IHUAYLLO","03","04","07"]
[null,"03 Apurímac","04 Aymaraes","08 Justo Apu Sahuaraura","03","04","08","Apurímac","Aymaraes","Justo Apu Sahuaraura","030408","APURÍMAC","AYMARAES","JUSTO APU SAHUARAURA","03","04","08"]
[null,"03 Apurímac","04 Aymaraes","09 Lucre","03","04","09","Apurímac","Aymaraes","Lucre","030409","APURÍMAC","AYMARAES","LUCRE","03","04","09"]
[null,"03 Apurímac","04 Aymaraes","10 Pocohuanca","03","04","10","Apurímac","Aymaraes","Pocohuanca","030410","APURÍMAC","AYMARAES","POCOHUANCA","03","04","10"]
[null,"03 Apurímac","04 Aymaraes","11 San Juan de Chacña","03","04","11","Apurímac","Aymaraes","San Juan de Chacña","030411","APURÍMAC","AYMARAES","SAN JUAN DE CHACÑA","03","04","11"]
[null,"03 Apurímac","04 Aymaraes","12 Sañayca","03","04","12","Apurímac","Aymaraes","Sañayca","030412","APURÍMAC","AYMARAES","SAÑAYCA","03","04","12"]
[null,"03 Apurímac","04 Aymaraes","13 Soraya","03","04","13","Apurímac","Aymaraes","Soraya","030413","APURÍMAC","AYMARAES","SORAYA","03","04","13"]
[null,"03 Apurímac","04 Aymaraes","14 Tapairihua","03","04","14","Apurímac","Aymaraes","Tapairihua","030414","APURÍMAC","AYMARAES","TAPAIRIHUA","03","04","14"]
[null,"03 Apurímac","04 Aymaraes","15 Tintay","03","04","15","Apurímac","Aymaraes","Tintay","030415","APURÍMAC","AYMARAES","TINTAY","03","04","15"]
[null,"03 Apurímac","04 Aymaraes","16 Toraya","03","04","16","Apurímac","Aymaraes","Toraya","030416","APURÍMAC","AYMARAES","TORAYA","03","04","16"]
[null,"03 Apurímac","04 Aymaraes","17 Yanaca","03","04","17","Apurímac","Aymaraes","Yanaca","030417","APURÍMAC","AYMARAES","YANACA","03","04","17"]
[null,"03 Apurímac","05 Cotabambas","01 Tambobamba","03","05","01","Apurímac","Cotabambas","Tambobamba","030501","APURÍMAC","COTABAMBAS","TAMBOBAMBA","03","05","01"]
[null,"03 Apurímac","05 Cotabambas","02 Cotabambas","03","05","02","Apurímac","Cotabambas","Cotabambas","030502","APURÍMAC","COTABAMBAS","COTABAMBAS","03","05","02"]
[null,"03 Apurímac","05 Cotabambas","03 Coyllurqui","03","05","03","Apurímac","Cotabambas","Coyllurqui","030503","APURÍMAC","COTABAMBAS","COYLLURQUI","03","05","03"]
[null,"03 Apurímac","05 Cotabambas","04 Haquira","03","05","04","Apurímac","Cotabambas","Haquira","030504","APURÍMAC","COTABAMBAS","HAQUIRA","03","05","04"]
[null,"03 Apurímac","05 Cotabambas","05 Mara","03","05","05","Apurímac","Cotabambas","Mara","030505","APURÍMAC","COTABAMBAS","MARA","03","05","05"]
[null,"03 Apurímac","05 Cotabambas","06 Challhuahuacho","03","05","06","Apurímac","Cotabambas","Challhuahuacho","030506","APURÍMAC","COTABAMBAS","CHALLHUAHUACHO","03","05","06"]
[null,"03 Apurímac","06 Chincheros","01 Chincheros","03","06","01","Apurímac","Chincheros","Chincheros","030601","APURÍMAC","CHINCHEROS","CHINCHEROS","03","06","01"]
[null,"03 Apurímac","06 Chincheros","02 Anco_Huallo","03","06","02","Apurímac","Chincheros","Anco_Huallo","030602","APURÍMAC","CHINCHEROS","ANCO_HUALLO","03","06","02"]
[null,"03 Apurímac","06 Chincheros","03 Cocharcas","03","06","03","Apurímac","Chincheros","Cocharcas","030603","APURÍMAC","CHINCHEROS","COCHARCAS","03","06","03"]
[null,"03 Apurímac","06 Chincheros","04 Huaccana","03","06","04","Apurímac","Chincheros","Huaccana","030604","APURÍMAC","CHINCHEROS","HUACCANA","03","06","04"]
[null,"03 Apurímac","06 Chincheros","05 Ocobamba","03","06","05","Apurímac","Chincheros","Ocobamba","030605","APURÍMAC","CHINCHEROS","OCOBAMBA","03","06","05"]
[null,"03 Apurímac","06 Chincheros","06 Ongoy","03","06","06","Apurímac","Chincheros","Ongoy","030606","APURÍMAC","CHINCHEROS","ONGOY","03","06","06"]
[null,"03 Apurímac","06 Chincheros","07 Uranmarca","03","06","07","Apurímac","Chincheros","Uranmarca","030607","APURÍMAC","CHINCHEROS","URANMARCA","03","06","07"]
[null,"03 Apurímac","06 Chincheros","08 Ranracancha","03","06","08","Apurímac","Chincheros","Ranracancha","030608","APURÍMAC","CHINCHEROS","RANRACANCHA","03","06","08"]
[null,"03 Apurímac","06 Chincheros","09 Rocchacc","03","06","09","Apurímac","Chincheros","Rocchacc","030609","APURÍMAC","CHINCHEROS","ROCCHACC","03","06","09"]
[null,"03 Apurímac","06 Chincheros","10 El Porvenir","03","06","10","Apurímac","Chincheros","El Porvenir","030610","APURÍMAC","CHINCHEROS","EL PORVENIR","03","06","10"]
[null,"03 Apurímac","06 Chincheros","11 Los Chankas","03","06","11","Apurímac","Chincheros","Los Chankas","030611","APURÍMAC","CHINCHEROS","LOS CHANKAS","03","06","11"]
[null,"03 Apurímac","07 Grau","01 Chuquibambilla",{"$f":"+MID(B324,1,2)","v":"03"},"07","01","Apurímac","Grau","Chuquibambilla",{"$f":"+CONCATENATE(E324,F324,G324)","v":"030701"},"APURÍMAC","GRAU","CHUQUIBAMBILLA","03","07","01"]
[null,"03 Apurímac","07 Grau","02 Curpahuasi","03","07","02","Apurímac","Grau","Curpahuasi","030702","APURÍMAC","GRAU","CURPAHUASI","03","07","02"]
[null,"03 Apurímac","07 Grau","03 Gamarra","03","07","03","Apurímac","Grau","Gamarra","030703","APURÍMAC","GRAU","GAMARRA","03","07","03"]
[null,"03 Apurímac","07 Grau","04 Huayllati","03","07","04","Apurímac","Grau","Huayllati","030704","APURÍMAC","GRAU","HUAYLLATI","03","07","04"]
[null,"03 Apurímac","07 Grau","05 Mamara","03","07","05","Apurímac","Grau","Mamara","030705","APURÍMAC","GRAU","MAMARA","03","07","05"]
[null,"03 Apurímac","07 Grau","06 Micaela Bastidas","03","07","06","Apurímac","Grau","Micaela Bastidas","030706","APURÍMAC","GRAU","MICAELA BASTIDAS","03","07","06"]
[null,"03 Apurímac","07 Grau","07 Pataypampa","03","07","07","Apurímac","Grau","Pataypampa","030707","APURÍMAC","GRAU","PATAYPAMPA","03","07","07"]
[null,"03 Apurímac","07 Grau","08 Progreso","03","07","08","Apurímac","Grau","Progreso","030708","APURÍMAC","GRAU","PROGRESO","03","07","08"]
[null,"03 Apurímac","07 Grau","09 San Antonio","03","07","09","Apurímac","Grau","San Antonio","030709","APURÍMAC","GRAU","SAN ANTONIO","03","07","09"]
[null,"03 Apurímac","07 Grau","10 Santa Rosa","03","07","10","Apurímac","Grau","Santa Rosa","030710","APURÍMAC","GRAU","SANTA ROSA","03","07","10"]
[null,"03 Apurímac","07 Grau","11 Turpay","03","07","11","Apurímac","Grau","Turpay","030711","APURÍMAC","GRAU","TURPAY","03","07","11"]
[null,"03 Apurímac","07 Grau","12 Vilcabamba","03","07","12","Apurímac","Grau","Vilcabamba","030712","APURÍMAC","GRAU","VILCABAMBA","03","07","12"]
[null,"03 Apurímac","07 Grau","13 Virundo","03","07","13","Apurímac","Grau","Virundo","030713","APURÍMAC","GRAU","VIRUNDO","03","07","13"]
[null,"03 Apurímac","07 Grau","14 Curasco","03","07","14","Apurímac","Grau","Curasco","030714","APURÍMAC","GRAU","CURASCO","03","07","14"]
[null,"04 Arequipa","01 Arequipa","01 Arequipa","04","01","01","Arequipa","Arequipa","Arequipa","040101","AREQUIPA","AREQUIPA","AREQUIPA","04","01","01"]
[null,"04 Arequipa","01 Arequipa","02 Alto Selva Alegre","04","01","02","Arequipa","Arequipa","Alto Selva Alegre","040102","AREQUIPA","AREQUIPA","ALTO SELVA ALEGRE","04","01","02"]
[null,"04 Arequipa","01 Arequipa","03 Cayma","04","01","03","Arequipa","Arequipa","Cayma","040103","AREQUIPA","AREQUIPA","CAYMA","04","01","03"]
[null,"04 Arequipa","01 Arequipa","04 Cerro Colorado","04","01","04","Arequipa","Arequipa","Cerro Colorado","040104","AREQUIPA","AREQUIPA","CERRO COLORADO","04","01","04"]
[null,"04 Arequipa","01 Arequipa","05 Characato","04","01","05","Arequipa","Arequipa","Characato","040105","AREQUIPA","AREQUIPA","CHARACATO","04","01","05"]
[null,"04 Arequipa","01 Arequipa","06 Chiguata","04","01","06","Arequipa","Arequipa","Chiguata","040106","AREQUIPA","AREQUIPA","CHIGUATA","04","01","06"]
[null,"04 Arequipa","01 Arequipa","07 Jacobo Hunter","04","01","07","Arequipa","Arequipa","Jacobo Hunter","040107","AREQUIPA","AREQUIPA","JACOBO HUNTER","04","01","07"]
[null,"04 Arequipa","01 Arequipa","08 La Joya","04","01","08","Arequipa","Arequipa","La Joya","040108","AREQUIPA","AREQUIPA","LA JOYA","04","01","08"]
[null,"04 Arequipa","01 Arequipa","09 Mariano Melgar","04","01","09","Arequipa","Arequipa","Mariano Melgar","040109","AREQUIPA","AREQUIPA","MARIANO MELGAR","04","01","09"]
[null,"04 Arequipa","01 Arequipa","10 Miraflores","04","01","10","Arequipa","Arequipa","Miraflores","040110","AREQUIPA","AREQUIPA","MIRAFLORES","04","01","10"]
[null,"04 Arequipa","01 Arequipa","11 Mollebaya","04","01","11","Arequipa","Arequipa","Mollebaya","040111","AREQUIPA","AREQUIPA","MOLLEBAYA","04","01","11"]
[null,"04 Arequipa","01 Arequipa","12 Paucarpata","04","01","12","Arequipa","Arequipa","Paucarpata","040112","AREQUIPA","AREQUIPA","PAUCARPATA","04","01","12"]
[null,"04 Arequipa","01 Arequipa","13 Pocsi","04","01","13","Arequipa","Arequipa","Pocsi","040113","AREQUIPA","AREQUIPA","POCSI","04","01","13"]
[null,"04 Arequipa","01 Arequipa","14 Polobaya","04","01","14","Arequipa","Arequipa","Polobaya","040114","AREQUIPA","AREQUIPA","POLOBAYA","04","01","14"]
[null,"04 Arequipa","01 Arequipa","15 Quequeña","04","01","15","Arequipa","Arequipa","Quequeña","040115","AREQUIPA","AREQUIPA","QUEQUEÑA","04","01","15"]
[null,"04 Arequipa","01 Arequipa","16 Sabandia","04","01","16","Arequipa","Arequipa","Sabandia","040116","AREQUIPA","AREQUIPA","SABANDIA","04","01","16"]
[null,"04 Arequipa","01 Arequipa","17 Sachaca","04","01","17","Arequipa","Arequipa","Sachaca","040117","AREQUIPA","AREQUIPA","SACHACA","04","01","17"]
[null,"04 Arequipa","01 Arequipa","18 San Juan de Siguas","04","01","18","Arequipa","Arequipa","San Juan de Siguas","040118","AREQUIPA","AREQUIPA","SAN JUAN DE SIGUAS","04","01","18"]
[null,"04 Arequipa","01 Arequipa","19 San Juan de Tarucani","04","01","19","Arequipa","Arequipa","San Juan de Tarucani","040119","AREQUIPA","AREQUIPA","SAN JUAN DE TARUCANI","04","01","19"]
[null,"04 Arequipa","01 Arequipa","20 Santa Isabel de Siguas","04","01","20","Arequipa","Arequipa","Santa Isabel de Siguas","040120","AREQUIPA","AREQUIPA","SANTA ISABEL DE SIGUAS","04","01","20"]
[null,"04 Arequipa","01 Arequipa","21 Santa Rita de Siguas","04","01","21","Arequipa","Arequipa","Santa Rita de Siguas","040121","AREQUIPA","AREQUIPA","SANTA RITA DE SIGUAS","04","01","21"]
[null,"04 Arequipa","01 Arequipa","22 Socabaya","04","01","22","Arequipa","Arequipa","Socabaya","040122","AREQUIPA","AREQUIPA","SOCABAYA","04","01","22"]
[null,"04 Arequipa","01 Arequipa","23 Tiabaya","04","01","23","Arequipa","Arequipa","Tiabaya","040123","AREQUIPA","AREQUIPA","TIABAYA","04","01","23"]
[null,"04 Arequipa","01 Arequipa","24 Uchumayo","04","01","24","Arequipa","Arequipa","Uchumayo","040124","AREQUIPA","AREQUIPA","UCHUMAYO","04","01","24"]
[null,"04 Arequipa","01 Arequipa","25 Vitor","04","01","25","Arequipa","Arequipa","Vitor","040125","AREQUIPA","AREQUIPA","VITOR","04","01","25"]
[null,"04 Arequipa","01 Arequipa","26 Yanahuara","04","01","26","Arequipa","Arequipa","Yanahuara","040126","AREQUIPA","AREQUIPA","YANAHUARA","04","01","26"]
[null,"04 Arequipa","01 Arequipa","27 Yarabamba","04","01","27","Arequipa","Arequipa","Yarabamba","040127","AREQUIPA","AREQUIPA","YARABAMBA","04","01","27"]
[null,"04 Arequipa","01 Arequipa","28 Yura","04","01","28","Arequipa","Arequipa","Yura","040128","AREQUIPA","AREQUIPA","YURA","04","01","28"]
[null,"04 Arequipa","01 Arequipa","29 José Luis Bustamante Y Rivero","04","01","29","Arequipa","Arequipa","José Luis Bustamante Y Rivero","040129","AREQUIPA","AREQUIPA","JOSÉ LUIS BUSTAMANTE Y RIVERO","04","01","29"]
[null,"04 Arequipa","02 Camaná","01 Camaná","04","02","01","Arequipa","Camaná","Camaná","040201","AREQUIPA","CAMANÁ","CAMANÁ","04","02","01"]
[null,"04 Arequipa","02 Camaná","02 José María Quimper","04","02","02","Arequipa","Camaná","José María Quimper","040202","AREQUIPA","CAMANÁ","JOSÉ MARÍA QUIMPER","04","02","02"]
[null,"04 Arequipa","02 Camaná","03 Mariano Nicolás Valcárcel","04","02","03","Arequipa","Camaná","Mariano Nicolás Valcárcel","040203","AREQUIPA","CAMANÁ","MARIANO NICOLÁS VALCÁRCEL","04","02","03"]
[null,"04 Arequipa","02 Camaná","04 Mariscal Cáceres","04","02","04","Arequipa","Camaná","Mariscal Cáceres","040204","AREQUIPA","CAMANÁ","MARISCAL CÁCERES","04","02","04"]
[null,"04 Arequipa","02 Camaná","05 Nicolás de Pierola","04","02","05","Arequipa","Camaná","Nicolás de Pierola","040205","AREQUIPA","CAMANÁ","NICOLÁS DE PIEROLA","04","02","05"]
[null,"04 Arequipa","02 Camaná","06 Ocoña","04","02","06","Arequipa","Camaná","Ocoña","040206","AREQUIPA","CAMANÁ","OCOÑA","04","02","06"]
[null,"04 Arequipa","02 Camaná","07 Quilca","04","02","07","Arequipa","Camaná","Quilca","040207","AREQUIPA","CAMANÁ","QUILCA","04","02","07"]
[null,"04 Arequipa","02 Camaná","08 Samuel Pastor","04","02","08","Arequipa","Camaná","Samuel Pastor","040208","AREQUIPA","CAMANÁ","SAMUEL PASTOR","04","02","08"]
[null,"04 Arequipa","03 Caravelí","01 Caravelí","04","03","01","Arequipa","Caravelí","Caravelí","040301","AREQUIPA","CARAVELÍ","CARAVELÍ","04","03","01"]
[null,"04 Arequipa","03 Caravelí","02 Acarí","04","03","02","Arequipa","Caravelí","Acarí","040302","AREQUIPA","CARAVELÍ","ACARÍ","04","03","02"]
[null,"04 Arequipa","03 Caravelí","03 Atico","04","03","03","Arequipa","Caravelí","Atico","040303","AREQUIPA","CARAVELÍ","ATICO","04","03","03"]
[null,"04 Arequipa","03 Caravelí","04 Atiquipa","04","03","04","Arequipa","Caravelí","Atiquipa","040304","AREQUIPA","CARAVELÍ","ATIQUIPA","04","03","04"]
[null,"04 Arequipa","03 Caravelí","05 Bella Unión","04","03","05","Arequipa","Caravelí","Bella Unión","040305","AREQUIPA","CARAVELÍ","BELLA UNIÓN","04","03","05"]
[null,"04 Arequipa","03 Caravelí","06 Cahuacho","04","03","06","Arequipa","Caravelí","Cahuacho","040306","AREQUIPA","CARAVELÍ","CAHUACHO","04","03","06"]
[null,"04 Arequipa","03 Caravelí","07 Chala","04","03","07","Arequipa","Caravelí","Chala","040307","AREQUIPA","CARAVELÍ","CHALA","04","03","07"]
[null,"04 Arequipa","03 Caravelí","08 Chaparra","04","03","08","Arequipa","Caravelí","Chaparra","040308","AREQUIPA","CARAVELÍ","CHAPARRA","04","03","08"]
[null,"04 Arequipa","03 Caravelí","09 Huanuhuanu","04","03","09","Arequipa","Caravelí","Huanuhuanu","040309","AREQUIPA","CARAVELÍ","HUANUHUANU","04","03","09"]
[null,"04 Arequipa","03 Caravelí","10 Jaqui","04","03","10","Arequipa","Caravelí","Jaqui","040310","AREQUIPA","CARAVELÍ","JAQUI","04","03","10"]
[null,"04 Arequipa","03 Caravelí","11 Lomas","04","03","11","Arequipa","Caravelí","Lomas","040311","AREQUIPA","CARAVELÍ","LOMAS","04","03","11"]
[null,"04 Arequipa","03 Caravelí","12 Quicacha","04","03","12","Arequipa","Caravelí","Quicacha","040312","AREQUIPA","CARAVELÍ","QUICACHA","04","03","12"]
[null,"04 Arequipa","03 Caravelí","13 Yauca","04","03","13","Arequipa","Caravelí","Yauca","040313","AREQUIPA","CARAVELÍ","YAUCA","04","03","13"]
[null,"04 Arequipa","04 Castilla","01 Aplao",{"$f":"+MID(B388,1,2)","v":"04"},"04","01","Arequipa","Castilla","Aplao",{"$f":"+CONCATENATE(E388,F388,G388)","v":"040401"},"AREQUIPA","CASTILLA","APLAO","04","04","01"]
[null,"04 Arequipa","04 Castilla","02 Andagua","04","04","02","Arequipa","Castilla","Andagua","040402","AREQUIPA","CASTILLA","ANDAGUA","04","04","02"]
[null,"04 Arequipa","04 Castilla","03 Ayo","04","04","03","Arequipa","Castilla","Ayo","040403","AREQUIPA","CASTILLA","AYO","04","04","03"]
[null,"04 Arequipa","04 Castilla","04 Chachas","04","04","04","Arequipa","Castilla","Chachas","040404","AREQUIPA","CASTILLA","CHACHAS","04","04","04"]
[null,"04 Arequipa","04 Castilla","05 Chilcaymarca","04","04","05","Arequipa","Castilla","Chilcaymarca","040405","AREQUIPA","CASTILLA","CHILCAYMARCA","04","04","05"]
[null,"04 Arequipa","04 Castilla","06 Choco","04","04","06","Arequipa","Castilla","Choco","040406","AREQUIPA","CASTILLA","CHOCO","04","04","06"]
[null,"04 Arequipa","04 Castilla","07 Huancarqui","04","04","07","Arequipa","Castilla","Huancarqui","040407","AREQUIPA","CASTILLA","HUANCARQUI","04","04","07"]
[null,"04 Arequipa","04 Castilla","08 Machaguay","04","04","08","Arequipa","Castilla","Machaguay","040408","AREQUIPA","CASTILLA","MACHAGUAY","04","04","08"]
[null,"04 Arequipa","04 Castilla","09 Orcopampa","04","04","09","Arequipa","Castilla","Orcopampa","040409","AREQUIPA","CASTILLA","ORCOPAMPA","04","04","09"]
[null,"04 Arequipa","04 Castilla","10 Pampacolca","04","04","10","Arequipa","Castilla","Pampacolca","040410","AREQUIPA","CASTILLA","PAMPACOLCA","04","04","10"]
[null,"04 Arequipa","04 Castilla","11 Tipan","04","04","11","Arequipa","Castilla","Tipan","040411","AREQUIPA","CASTILLA","TIPAN","04","04","11"]
[null,"04 Arequipa","04 Castilla","12 Uñon","04","04","12","Arequipa","Castilla","Uñon","040412","AREQUIPA","CASTILLA","UÑON","04","04","12"]
[null,"04 Arequipa","04 Castilla","13 Uraca","04","04","13","Arequipa","Castilla","Uraca","040413","AREQUIPA","CASTILLA","URACA","04","04","13"]
[null,"04 Arequipa","04 Castilla","14 Viraco","04","04","14","Arequipa","Castilla","Viraco","040414","AREQUIPA","CASTILLA","VIRACO","04","04","14"]
[null,"04 Arequipa","05 Caylloma","01 Chivay","04","05","01","Arequipa","Caylloma","Chivay","040501","AREQUIPA","CAYLLOMA","CHIVAY","04","05","01"]
[null,"04 Arequipa","05 Caylloma","02 Achoma","04","05","02","Arequipa","Caylloma","Achoma","040502","AREQUIPA","CAYLLOMA","ACHOMA","04","05","02"]
[null,"04 Arequipa","05 Caylloma","03 Cabanaconde","04","05","03","Arequipa","Caylloma","Cabanaconde","040503","AREQUIPA","CAYLLOMA","CABANACONDE","04","05","03"]
[null,"04 Arequipa","05 Caylloma","04 Callalli","04","05","04","Arequipa","Caylloma","Callalli","040504","AREQUIPA","CAYLLOMA","CALLALLI","04","05","04"]
[null,"04 Arequipa","05 Caylloma","05 Caylloma","04","05","05","Arequipa","Caylloma","Caylloma","040505","AREQUIPA","CAYLLOMA","CAYLLOMA","04","05","05"]
[null,"04 Arequipa","05 Caylloma","06 Coporaque","04","05","06","Arequipa","Caylloma","Coporaque","040506","AREQUIPA","CAYLLOMA","COPORAQUE","04","05","06"]
[null,"04 Arequipa","05 Caylloma","07 Huambo","04","05","07","Arequipa","Caylloma","Huambo","040507","AREQUIPA","CAYLLOMA","HUAMBO","04","05","07"]
[null,"04 Arequipa","05 Caylloma","08 Huanca","04","05","08","Arequipa","Caylloma","Huanca","040508","AREQUIPA","CAYLLOMA","HUANCA","04","05","08"]
[null,"04 Arequipa","05 Caylloma","09 Ichupampa","04","05","09","Arequipa","Caylloma","Ichupampa","040509","AREQUIPA","CAYLLOMA","ICHUPAMPA","04","05","09"]
[null,"04 Arequipa","05 Caylloma","10 Lari","04","05","10","Arequipa","Caylloma","Lari","040510","AREQUIPA","CAYLLOMA","LARI","04","05","10"]
[null,"04 Arequipa","05 Caylloma","11 Lluta","04","05","11","Arequipa","Caylloma","Lluta","040511","AREQUIPA","CAYLLOMA","LLUTA","04","05","11"]
[null,"04 Arequipa","05 Caylloma","12 Maca","04","05","12","Arequipa","Caylloma","Maca","040512","AREQUIPA","CAYLLOMA","MACA","04","05","12"]
[null,"04 Arequipa","05 Caylloma","13 Madrigal","04","05","13","Arequipa","Caylloma","Madrigal","040513","AREQUIPA","CAYLLOMA","MADRIGAL","04","05","13"]
[null,"04 Arequipa","05 Caylloma","14 San Antonio de Chuca","04","05","14","Arequipa","Caylloma","San Antonio de Chuca","040514","AREQUIPA","CAYLLOMA","SAN ANTONIO DE CHUCA","04","05","14"]
[null,"04 Arequipa","05 Caylloma","15 Sibayo","04","05","15","Arequipa","Caylloma","Sibayo","040515","AREQUIPA","CAYLLOMA","SIBAYO","04","05","15"]
[null,"04 Arequipa","05 Caylloma","16 Tapay","04","05","16","Arequipa","Caylloma","Tapay","040516","AREQUIPA","CAYLLOMA","TAPAY","04","05","16"]
[null,"04 Arequipa","05 Caylloma","17 Tisco","04","05","17","Arequipa","Caylloma","Tisco","040517","AREQUIPA","CAYLLOMA","TISCO","04","05","17"]
[null,"04 Arequipa","05 Caylloma","18 Tuti","04","05","18","Arequipa","Caylloma","Tuti","040518","AREQUIPA","CAYLLOMA","TUTI","04","05","18"]
[null,"04 Arequipa","05 Caylloma","19 Yanque","04","05","19","Arequipa","Caylloma","Yanque","040519","AREQUIPA","CAYLLOMA","YANQUE","04","05","19"]
[null,"04 Arequipa","05 Caylloma","20 Majes","04","05","20","Arequipa","Caylloma","Majes","040520","AREQUIPA","CAYLLOMA","MAJES","04","05","20"]
[null,"04 Arequipa","06 Condesuyos","01 Chuquibamba","04","06","01","Arequipa","Condesuyos","Chuquibamba","040601","AREQUIPA","CONDESUYOS","CHUQUIBAMBA","04","06","01"]
[null,"04 Arequipa","06 Condesuyos","02 Andaray","04","06","02","Arequipa","Condesuyos","Andaray","040602","AREQUIPA","CONDESUYOS","ANDARAY","04","06","02"]
[null,"04 Arequipa","06 Condesuyos","03 Cayarani","04","06","03","Arequipa","Condesuyos","Cayarani","040603","AREQUIPA","CONDESUYOS","CAYARANI","04","06","03"]
[null,"04 Arequipa","06 Condesuyos","04 Chichas","04","06","04","Arequipa","Condesuyos","Chichas","040604","AREQUIPA","CONDESUYOS","CHICHAS","04","06","04"]
[null,"04 Arequipa","06 Condesuyos","05 Iray","04","06","05","Arequipa","Condesuyos","Iray","040605","AREQUIPA","CONDESUYOS","IRAY","04","06","05"]
[null,"04 Arequipa","06 Condesuyos","06 Río Grande","04","06","06","Arequipa","Condesuyos","Río Grande","040606","AREQUIPA","CONDESUYOS","RÍO GRANDE","04","06","06"]
[null,"04 Arequipa","06 Condesuyos","07 Salamanca","04","06","07","Arequipa","Condesuyos","Salamanca","040607","AREQUIPA","CONDESUYOS","SALAMANCA","04","06","07"]
[null,"04 Arequipa","06 Condesuyos","08 Yanaquihua","04","06","08","Arequipa","Condesuyos","Yanaquihua","040608","AREQUIPA","CONDESUYOS","YANAQUIHUA","04","06","08"]
[null,"04 Arequipa","07 Islay","01 Mollendo","04","07","01","Arequipa","Islay","Mollendo","040701","AREQUIPA","ISLAY","MOLLENDO","04","07","01"]
[null,"04 Arequipa","07 Islay","02 Cocachacra","04","07","02","Arequipa","Islay","Cocachacra","040702","AREQUIPA","ISLAY","COCACHACRA","04","07","02"]
[null,"04 Arequipa","07 Islay","03 Dean Valdivia","04","07","03","Arequipa","Islay","Dean Valdivia","040703","AREQUIPA","ISLAY","DEAN VALDIVIA","04","07","03"]
[null,"04 Arequipa","07 Islay","04 Islay","04","07","04","Arequipa","Islay","Islay","040704","AREQUIPA","ISLAY","ISLAY","04","07","04"]
[null,"04 Arequipa","07 Islay","05 Mejia","04","07","05","Arequipa","Islay","Mejia","040705","AREQUIPA","ISLAY","MEJIA","04","07","05"]
[null,"04 Arequipa","07 Islay","06 Punta de Bombón","04","07","06","Arequipa","Islay","Punta de Bombón","040706","AREQUIPA","ISLAY","PUNTA DE BOMBÓN","04","07","06"]
[null,"04 Arequipa","08 La Uniòn","01 Cotahuasi","04","08","01","Arequipa","La Uniòn","Cotahuasi","040801","AREQUIPA","LA UNIÒN","COTAHUASI","04","08","01"]
[null,"04 Arequipa","08 La Uniòn","02 Alca","04","08","02","Arequipa","La Uniòn","Alca","040802","AREQUIPA","LA UNIÒN","ALCA","04","08","02"]
[null,"04 Arequipa","08 La Uniòn","03 Charcana","04","08","03","Arequipa","La Uniòn","Charcana","040803","AREQUIPA","LA UNIÒN","CHARCANA","04","08","03"]
[null,"04 Arequipa","08 La Uniòn","04 Huaynacotas","04","08","04","Arequipa","La Uniòn","Huaynacotas","040804","AREQUIPA","LA UNIÒN","HUAYNACOTAS","04","08","04"]
[null,"04 Arequipa","08 La Uniòn","05 Pampamarca","04","08","05","Arequipa","La Uniòn","Pampamarca","040805","AREQUIPA","LA UNIÒN","PAMPAMARCA","04","08","05"]
[null,"04 Arequipa","08 La Uniòn","06 Puyca","04","08","06","Arequipa","La Uniòn","Puyca","040806","AREQUIPA","LA UNIÒN","PUYCA","04","08","06"]
[null,"04 Arequipa","08 La Uniòn","07 Quechualla","04","08","07","Arequipa","La Uniòn","Quechualla","040807","AREQUIPA","LA UNIÒN","QUECHUALLA","04","08","07"]
[null,"04 Arequipa","08 La Uniòn","08 Sayla","04","08","08","Arequipa","La Uniòn","Sayla","040808","AREQUIPA","LA UNIÒN","SAYLA","04","08","08"]
[null,"04 Arequipa","08 La Uniòn","09 Tauria","04","08","09","Arequipa","La Uniòn","Tauria","040809","AREQUIPA","LA UNIÒN","TAURIA","04","08","09"]
[null,"04 Arequipa","08 La Uniòn","10 Tomepampa","04","08","10","Arequipa","La Uniòn","Tomepampa","040810","AREQUIPA","LA UNIÒN","TOMEPAMPA","04","08","10"]
[null,"04 Arequipa","08 La Uniòn","11 Toro","04","08","11","Arequipa","La Uniòn","Toro","040811","AREQUIPA","LA UNIÒN","TORO","04","08","11"]
[null,"05 Ayacucho","01 Huamanga","01 Ayacucho","05","01","01","Ayacucho","Huamanga","Ayacucho","050101","AYACUCHO","HUAMANGA","AYACUCHO","05","01","01"]
[null,"05 Ayacucho","01 Huamanga","02 Acocro","05","01","02","Ayacucho","Huamanga","Acocro","050102","AYACUCHO","HUAMANGA","ACOCRO","05","01","02"]
[null,"05 Ayacucho","01 Huamanga","03 Acos Vinchos","05","01","03","Ayacucho","Huamanga","Acos Vinchos","050103","AYACUCHO","HUAMANGA","ACOS VINCHOS","05","01","03"]
[null,"05 Ayacucho","01 Huamanga","04 Carmen Alto","05","01","04","Ayacucho","Huamanga","Carmen Alto","050104","AYACUCHO","HUAMANGA","CARMEN ALTO","05","01","04"]
[null,"05 Ayacucho","01 Huamanga","05 Chiara","05","01","05","Ayacucho","Huamanga","Chiara","050105","AYACUCHO","HUAMANGA","CHIARA","05","01","05"]
[null,"05 Ayacucho","01 Huamanga","06 Ocros",{"$f":"+MID(B452,1,2)","v":"05"},"01","06","Ayacucho","Huamanga","Ocros",{"$f":"+CONCATENATE(E452,F452,G452)","v":"050106"},"AYACUCHO","HUAMANGA","OCROS","05","01","06"]
[null,"05 Ayacucho","01 Huamanga","07 Pacaycasa","05","01","07","Ayacucho","Huamanga","Pacaycasa","050107","AYACUCHO","HUAMANGA","PACAYCASA","05","01","07"]
[null,"05 Ayacucho","01 Huamanga","08 Quinua","05","01","08","Ayacucho","Huamanga","Quinua","050108","AYACUCHO","HUAMANGA","QUINUA","05","01","08"]
[null,"05 Ayacucho","01 Huamanga","09 San José de Ticllas","05","01","09","Ayacucho","Huamanga","San José de Ticllas","050109","AYACUCHO","HUAMANGA","SAN JOSÉ DE TICLLAS","05","01","09"]
[null,"05 Ayacucho","01 Huamanga","10 San Juan Bautista","05","01","10","Ayacucho","Huamanga","San Juan Bautista","050110","AYACUCHO","HUAMANGA","SAN JUAN BAUTISTA","05","01","10"]
[null,"05 Ayacucho","01 Huamanga","11 Santiago de Pischa","05","01","11","Ayacucho","Huamanga","Santiago de Pischa","050111","AYACUCHO","HUAMANGA","SANTIAGO DE PISCHA","05","01","11"]
[null,"05 Ayacucho","01 Huamanga","12 Socos","05","01","12","Ayacucho","Huamanga","Socos","050112","AYACUCHO","HUAMANGA","SOCOS","05","01","12"]
[null,"05 Ayacucho","01 Huamanga","13 Tambillo","05","01","13","Ayacucho","Huamanga","Tambillo","050113","AYACUCHO","HUAMANGA","TAMBILLO","05","01","13"]
[null,"05 Ayacucho","01 Huamanga","14 Vinchos","05","01","14","Ayacucho","Huamanga","Vinchos","050114","AYACUCHO","HUAMANGA","VINCHOS","05","01","14"]
[null,"05 Ayacucho","01 Huamanga","15 Jesús Nazareno","05","01","15","Ayacucho","Huamanga","Jesús Nazareno","050115","AYACUCHO","HUAMANGA","JESÚS NAZARENO","05","01","15"]
[null,"05 Ayacucho","01 Huamanga","16 Andrés Avelino Cáceres Dorregaray","05","01","16","Ayacucho","Huamanga","Andrés Avelino Cáceres Dorrega","050116","AYACUCHO","HUAMANGA","ANDRÉS AVELINO CÁCERES DORREGA","05","01","16"]
[null,"05 Ayacucho","02 Cangallo","01 Cangallo","05","02","01","Ayacucho","Cangallo","Cangallo","050201","AYACUCHO","CANGALLO","CANGALLO","05","02","01"]
[null,"05 Ayacucho","02 Cangallo","02 Chuschi","05","02","02","Ayacucho","Cangallo","Chuschi","050202","AYACUCHO","CANGALLO","CHUSCHI","05","02","02"]
[null,"05 Ayacucho","02 Cangallo","03 Los Morochucos","05","02","03","Ayacucho","Cangallo","Los Morochucos","050203","AYACUCHO","CANGALLO","LOS MOROCHUCOS","05","02","03"]
[null,"05 Ayacucho","02 Cangallo","04 María Parado de Bellido","05","02","04","Ayacucho","Cangallo","María Parado de Bellido","050204","AYACUCHO","CANGALLO","MARÍA PARADO DE BELLIDO","05","02","04"]
[null,"05 Ayacucho","02 Cangallo","05 Paras","05","02","05","Ayacucho","Cangallo","Paras","050205","AYACUCHO","CANGALLO","PARAS","05","02","05"]
[null,"05 Ayacucho","02 Cangallo","06 Totos","05","02","06","Ayacucho","Cangallo","Totos","050206","AYACUCHO","CANGALLO","TOTOS","05","02","06"]
[null,"05 Ayacucho","03 Huanca Sancos","01 Sancos","05","03","01","Ayacucho","Huanca Sancos","Sancos","050301","AYACUCHO","HUANCA SANCOS","SANCOS","05","03","01"]
[null,"05 Ayacucho","03 Huanca Sancos","02 Carapo","05","03","02","Ayacucho","Huanca Sancos","Carapo","050302","AYACUCHO","HUANCA SANCOS","CARAPO","05","03","02"]
[null,"05 Ayacucho","03 Huanca Sancos","03 Sacsamarca","05","03","03","Ayacucho","Huanca Sancos","Sacsamarca","050303","AYACUCHO","HUANCA SANCOS","SACSAMARCA","05","03","03"]
[null,"05 Ayacucho","03 Huanca Sancos","04 Santiago de Lucanamarca","05","03","04","Ayacucho","Huanca Sancos","Santiago de Lucanamarca","050304","AYACUCHO","HUANCA SANCOS","SANTIAGO DE LUCANAMARCA","05","03","04"]
[null,"05 Ayacucho","04 Huanta","01 Huanta","05","04","01","Ayacucho","Huanta","Huanta","050401","AYACUCHO","HUANTA","HUANTA","05","04","01"]
[null,"05 Ayacucho","04 Huanta","02 Ayahuanco","05","04","02","Ayacucho","Huanta","Ayahuanco","050402","AYACUCHO","HUANTA","AYAHUANCO","05","04","02"]
[null,"05 Ayacucho","04 Huanta","03 Huamanguilla","05","04","03","Ayacucho","Huanta","Huamanguilla","050403","AYACUCHO","HUANTA","HUAMANGUILLA","05","04","03"]
[null,"05 Ayacucho","04 Huanta","04 Iguain","05","04","04","Ayacucho","Huanta","Iguain","050404","AYACUCHO","HUANTA","IGUAIN","05","04","04"]
[null,"05 Ayacucho","04 Huanta","05 Luricocha","05","04","05","Ayacucho","Huanta","Luricocha","050405","AYACUCHO","HUANTA","LURICOCHA","05","04","05"]
[null,"05 Ayacucho","04 Huanta","06 Santillana","05","04","06","Ayacucho","Huanta","Santillana","050406","AYACUCHO","HUANTA","SANTILLANA","05","04","06"]
[null,"05 Ayacucho","04 Huanta","07 Sivia","05","04","07","Ayacucho","Huanta","Sivia","050407","AYACUCHO","HUANTA","SIVIA","05","04","07"]
[null,"05 Ayacucho","04 Huanta","08 Llochegua","05","04","08","Ayacucho","Huanta","Llochegua","050408","AYACUCHO","HUANTA","LLOCHEGUA","05","04","08"]
[null,"05 Ayacucho","04 Huanta","09 Canayre","05","04","09","Ayacucho","Huanta","Canayre","050409","AYACUCHO","HUANTA","CANAYRE","05","04","09"]
[null,"05 Ayacucho","04 Huanta","10 Uchuraccay","05","04","10","Ayacucho","Huanta","Uchuraccay","050410","AYACUCHO","HUANTA","UCHURACCAY","05","04","10"]
[null,"05 Ayacucho","04 Huanta","11 Pucacolpa","05","04","11","Ayacucho","Huanta","Pucacolpa","050411","AYACUCHO","HUANTA","PUCACOLPA","05","04","11"]
[null,"05 Ayacucho","04 Huanta","12 Chaca","05","04","12","Ayacucho","Huanta","Chaca","050412","AYACUCHO","HUANTA","CHACA","05","04","12"]
[null,"05 Ayacucho","05 La Mar","01 San Miguel","05","05","01","Ayacucho","La Mar","San Miguel","050501","AYACUCHO","LA MAR","SAN MIGUEL","05","05","01"]
[null,"05 Ayacucho","05 La Mar","02 Anco","05","05","02","Ayacucho","La Mar","Anco","050502","AYACUCHO","LA MAR","ANCO","05","05","02"]
[null,"05 Ayacucho","05 La Mar","03 Ayna","05","05","03","Ayacucho","La Mar","Ayna","050503","AYACUCHO","LA MAR","AYNA","05","05","03"]
[null,"05 Ayacucho","05 La Mar","04 Chilcas","05","05","04","Ayacucho","La Mar","Chilcas","050504","AYACUCHO","LA MAR","CHILCAS","05","05","04"]
[null,"05 Ayacucho","05 La Mar","05 Chungui","05","05","05","Ayacucho","La Mar","Chungui","050505","AYACUCHO","LA MAR","CHUNGUI","05","05","05"]
[null,"05 Ayacucho","05 La Mar","06 Luis Carranza","05","05","06","Ayacucho","La Mar","Luis Carranza","050506","AYACUCHO","LA MAR","LUIS CARRANZA","05","05","06"]
[null,"05 Ayacucho","05 La Mar","07 Santa Rosa","05","05","07","Ayacucho","La Mar","Santa Rosa","050507","AYACUCHO","LA MAR","SANTA ROSA","05","05","07"]
[null,"05 Ayacucho","05 La Mar","08 Tambo","05","05","08","Ayacucho","La Mar","Tambo","050508","AYACUCHO","LA MAR","TAMBO","05","05","08"]
[null,"05 Ayacucho","05 La Mar","09 Samugari","05","05","09","Ayacucho","La Mar","Samugari","050509","AYACUCHO","LA MAR","SAMUGARI","05","05","09"]
[null,"05 Ayacucho","05 La Mar","10 Anchihuay","05","05","10","Ayacucho","La Mar","Anchihuay","050510","AYACUCHO","LA MAR","ANCHIHUAY","05","05","10"]
[null,"05 Ayacucho","05 La Mar","11 Oronccoy","05","05","11","Ayacucho","La Mar","Oronccoy","050511","AYACUCHO","LA MAR","ORONCCOY","05","05","11"]
[null,"05 Ayacucho","06 Lucanas","01 Puquio","05","06","01","Ayacucho","Lucanas","Puquio","050601","AYACUCHO","LUCANAS","PUQUIO","05","06","01"]
[null,"05 Ayacucho","06 Lucanas","02 Aucara","05","06","02","Ayacucho","Lucanas","Aucara","050602","AYACUCHO","LUCANAS","AUCARA","05","06","02"]
[null,"05 Ayacucho","06 Lucanas","03 Cabana","05","06","03","Ayacucho","Lucanas","Cabana","050603","AYACUCHO","LUCANAS","CABANA","05","06","03"]
[null,"05 Ayacucho","06 Lucanas","04 Carmen Salcedo","05","06","04","Ayacucho","Lucanas","Carmen Salcedo","050604","AYACUCHO","LUCANAS","CARMEN SALCEDO","05","06","04"]
[null,"05 Ayacucho","06 Lucanas","05 Chaviña","05","06","05","Ayacucho","Lucanas","Chaviña","050605","AYACUCHO","LUCANAS","CHAVIÑA","05","06","05"]
[null,"05 Ayacucho","06 Lucanas","06 Chipao","05","06","06","Ayacucho","Lucanas","Chipao","050606","AYACUCHO","LUCANAS","CHIPAO","05","06","06"]
[null,"05 Ayacucho","06 Lucanas","07 Huac-Huas","05","06","07","Ayacucho","Lucanas","Huac-Huas","050607","AYACUCHO","LUCANAS","HUAC-HUAS","05","06","07"]
[null,"05 Ayacucho","06 Lucanas","08 Laramate","05","06","08","Ayacucho","Lucanas","Laramate","050608","AYACUCHO","LUCANAS","LARAMATE","05","06","08"]
[null,"05 Ayacucho","06 Lucanas","09 Leoncio Prado","05","06","09","Ayacucho","Lucanas","Leoncio Prado","050609","AYACUCHO","LUCANAS","LEONCIO PRADO","05","06","09"]
[null,"05 Ayacucho","06 Lucanas","10 Llauta","05","06","10","Ayacucho","Lucanas","Llauta","050610","AYACUCHO","LUCANAS","LLAUTA","05","06","10"]
[null,"05 Ayacucho","06 Lucanas","11 Lucanas","05","06","11","Ayacucho","Lucanas","Lucanas","050611","AYACUCHO","LUCANAS","LUCANAS","05","06","11"]
[null,"05 Ayacucho","06 Lucanas","12 Ocaña","05","06","12","Ayacucho","Lucanas","Ocaña","050612","AYACUCHO","LUCANAS","OCAÑA","05","06","12"]
[null,"05 Ayacucho","06 Lucanas","13 Otoca","05","06","13","Ayacucho","Lucanas","Otoca","050613","AYACUCHO","LUCANAS","OTOCA","05","06","13"]
[null,"05 Ayacucho","06 Lucanas","14 Saisa","05","06","14","Ayacucho","Lucanas","Saisa","050614","AYACUCHO","LUCANAS","SAISA","05","06","14"]
[null,"05 Ayacucho","06 Lucanas","15 San Cristóbal","05","06","15","Ayacucho","Lucanas","San Cristóbal","050615","AYACUCHO","LUCANAS","SAN CRISTÓBAL","05","06","15"]
[null,"05 Ayacucho","06 Lucanas","16 San Juan","05","06","16","Ayacucho","Lucanas","San Juan","050616","AYACUCHO","LUCANAS","SAN JUAN","05","06","16"]
[null,"05 Ayacucho","06 Lucanas","17 San Pedro","05","06","17","Ayacucho","Lucanas","San Pedro","050617","AYACUCHO","LUCANAS","SAN PEDRO","05","06","17"]
[null,"05 Ayacucho","06 Lucanas","18 San Pedro de Palco","05","06","18","Ayacucho","Lucanas","San Pedro de Palco","050618","AYACUCHO","LUCANAS","SAN PEDRO DE PALCO","05","06","18"]
[null,"05 Ayacucho","06 Lucanas","19 Sancos","05","06","19","Ayacucho","Lucanas","Sancos","050619","AYACUCHO","LUCANAS","SANCOS","05","06","19"]
[null,"05 Ayacucho","06 Lucanas","20 Santa Ana de Huaycahuacho","05","06","20","Ayacucho","Lucanas","Santa Ana de Huaycahuacho","050620","AYACUCHO","LUCANAS","SANTA ANA DE HUAYCAHUACHO","05","06","20"]
[null,"05 Ayacucho","06 Lucanas","21 Santa Lucia",{"$f":"+MID(B516,1,2)","v":"05"},"06","21","Ayacucho","Lucanas","Santa Lucia",{"$f":"+CONCATENATE(E516,F516,G516)","v":"050621"},"AYACUCHO","LUCANAS","SANTA LUCIA","05","06","21"]
[null,"05 Ayacucho","07 Parinacochas","01 Coracora","05","07","01","Ayacucho","Parinacochas","Coracora","050701","AYACUCHO","PARINACOCHAS","CORACORA","05","07","01"]
[null,"05 Ayacucho","07 Parinacochas","02 Chumpi","05","07","02","Ayacucho","Parinacochas","Chumpi","050702","AYACUCHO","PARINACOCHAS","CHUMPI","05","07","02"]
[null,"05 Ayacucho","07 Parinacochas","03 Coronel Castañeda","05","07","03","Ayacucho","Parinacochas","Coronel Castañeda","050703","AYACUCHO","PARINACOCHAS","CORONEL CASTAÑEDA","05","07","03"]
[null,"05 Ayacucho","07 Parinacochas","04 Pacapausa","05","07","04","Ayacucho","Parinacochas","Pacapausa","050704","AYACUCHO","PARINACOCHAS","PACAPAUSA","05","07","04"]
[null,"05 Ayacucho","07 Parinacochas","05 Pullo","05","07","05","Ayacucho","Parinacochas","Pullo","050705","AYACUCHO","PARINACOCHAS","PULLO","05","07","05"]
[null,"05 Ayacucho","07 Parinacochas","06 Puyusca","05","07","06","Ayacucho","Parinacochas","Puyusca","050706","AYACUCHO","PARINACOCHAS","PUYUSCA","05","07","06"]
[null,"05 Ayacucho","07 Parinacochas","07 San Francisco de Ravacayco","05","07","07","Ayacucho","Parinacochas","San Francisco de Ravacayco","050707","AYACUCHO","PARINACOCHAS","SAN FRANCISCO DE RAVACAYCO","05","07","07"]
[null,"05 Ayacucho","07 Parinacochas","08 Upahuacho","05","07","08","Ayacucho","Parinacochas","Upahuacho","050708","AYACUCHO","PARINACOCHAS","UPAHUACHO","05","07","08"]
[null,"05 Ayacucho","08 Pàucar del Sara Sara","01 Pausa","05","08","01","Ayacucho","Pàucar del Sara Sara","Pausa","050801","AYACUCHO","PÀUCAR DEL SARA SARA","PAUSA","05","08","01"]
[null,"05 Ayacucho","08 Pàucar del Sara Sara","02 Colta","05","08","02","Ayacucho","Pàucar del Sara Sara","Colta","050802","AYACUCHO","PÀUCAR DEL SARA SARA","COLTA","05","08","02"]
[null,"05 Ayacucho","08 Pàucar del Sara Sara","03 Corculla","05","08","03","Ayacucho","Pàucar del Sara Sara","Corculla","050803","AYACUCHO","PÀUCAR DEL SARA SARA","CORCULLA","05","08","03"]
[null,"05 Ayacucho","08 Pàucar del Sara Sara","04 Lampa","05","08","04","Ayacucho","Pàucar del Sara Sara","Lampa","050804","AYACUCHO","PÀUCAR DEL SARA SARA","LAMPA","05","08","04"]
[null,"05 Ayacucho","08 Pàucar del Sara Sara","05 Marcabamba","05","08","05","Ayacucho","Pàucar del Sara Sara","Marcabamba","050805","AYACUCHO","PÀUCAR DEL SARA SARA","MARCABAMBA","05","08","05"]
[null,"05 Ayacucho","08 Pàucar del Sara Sara","06 Oyolo","05","08","06","Ayacucho","Pàucar del Sara Sara","Oyolo","050806","AYACUCHO","PÀUCAR DEL SARA SARA","OYOLO","05","08","06"]
[null,"05 Ayacucho","08 Pàucar del Sara Sara","07 Pararca","05","08","07","Ayacucho","Pàucar del Sara Sara","Pararca","050807","AYACUCHO","PÀUCAR DEL SARA SARA","PARARCA","05","08","07"]
[null,"05 Ayacucho","08 Pàucar del Sara Sara","08 San Javier de Alpabamba","05","08","08","Ayacucho","Pàucar del Sara Sara","San Javier de Alpabamba","050808","AYACUCHO","PÀUCAR DEL SARA SARA","SAN JAVIER DE ALPABAMBA","05","08","08"]
[null,"05 Ayacucho","08 Pàucar del Sara Sara","09 San José de Ushua","05","08","09","Ayacucho","Pàucar del Sara Sara","San José de Ushua","050809","AYACUCHO","PÀUCAR DEL SARA SARA","SAN JOSÉ DE USHUA","05","08","09"]
[null,"05 Ayacucho","08 Pàucar del Sara Sara","10 Sara Sara","05","08","10","Ayacucho","Pàucar del Sara Sara","Sara Sara","050810","AYACUCHO","PÀUCAR DEL SARA SARA","SARA SARA","05","08","10"]
[null,"05 Ayacucho","09 Sucre","01 Querobamba","05","09","01","Ayacucho","Sucre","Querobamba","050901","AYACUCHO","SUCRE","QUEROBAMBA","05","09","01"]
[null,"05 Ayacucho","09 Sucre","02 Belén","05","09","02","Ayacucho","Sucre","Belén","050902","AYACUCHO","SUCRE","BELÉN","05","09","02"]
[null,"05 Ayacucho","09 Sucre","03 Chalcos","05","09","03","Ayacucho","Sucre","Chalcos","050903","AYACUCHO","SUCRE","CHALCOS","05","09","03"]
[null,"05 Ayacucho","09 Sucre","04 Chilcayoc","05","09","04","Ayacucho","Sucre","Chilcayoc","050904","AYACUCHO","SUCRE","CHILCAYOC","05","09","04"]
[null,"05 Ayacucho","09 Sucre","05 Huacaña","05","09","05","Ayacucho","Sucre","Huacaña","050905","AYACUCHO","SUCRE","HUACAÑA","05","09","05"]
[null,"05 Ayacucho","09 Sucre","06 Morcolla","05","09","06","Ayacucho","Sucre","Morcolla","050906","AYACUCHO","SUCRE","MORCOLLA","05","09","06"]
[null,"05 Ayacucho","09 Sucre","07 Paico","05","09","07","Ayacucho","Sucre","Paico","050907","AYACUCHO","SUCRE","PAICO","05","09","07"]
[null,"05 Ayacucho","09 Sucre","08 San Pedro de Larcay","05","09","08","Ayacucho","Sucre","San Pedro de Larcay","050908","AYACUCHO","SUCRE","SAN PEDRO DE LARCAY","05","09","08"]
[null,"05 Ayacucho","09 Sucre","09 San Salvador de Quije","05","09","09","Ayacucho","Sucre","San Salvador de Quije","050909","AYACUCHO","SUCRE","SAN SALVADOR DE QUIJE","05","09","09"]
[null,"05 Ayacucho","09 Sucre","10 Santiago de Paucaray","05","09","10","Ayacucho","Sucre","Santiago de Paucaray","050910","AYACUCHO","SUCRE","SANTIAGO DE PAUCARAY","05","09","10"]
[null,"05 Ayacucho","09 Sucre","11 Soras","05","09","11","Ayacucho","Sucre","Soras","050911","AYACUCHO","SUCRE","SORAS","05","09","11"]
[null,"05 Ayacucho","10 Víctor Fajardo","01 Huancapi","05","10","01","Ayacucho","Víctor Fajardo","Huancapi","051001","AYACUCHO","VÍCTOR FAJARDO","HUANCAPI","05","10","01"]
[null,"05 Ayacucho","10 Víctor Fajardo","02 Alcamenca","05","10","02","Ayacucho","Víctor Fajardo","Alcamenca","051002","AYACUCHO","VÍCTOR FAJARDO","ALCAMENCA","05","10","02"]
[null,"05 Ayacucho","10 Víctor Fajardo","03 Apongo","05","10","03","Ayacucho","Víctor Fajardo","Apongo","051003","AYACUCHO","VÍCTOR FAJARDO","APONGO","05","10","03"]
[null,"05 Ayacucho","10 Víctor Fajardo","04 Asquipata","05","10","04","Ayacucho","Víctor Fajardo","Asquipata","051004","AYACUCHO","VÍCTOR FAJARDO","ASQUIPATA","05","10","04"]
[null,"05 Ayacucho","10 Víctor Fajardo","05 Canaria","05","10","05","Ayacucho","Víctor Fajardo","Canaria","051005","AYACUCHO","VÍCTOR FAJARDO","CANARIA","05","10","05"]
[null,"05 Ayacucho","10 Víctor Fajardo","06 Cayara","05","10","06","Ayacucho","Víctor Fajardo","Cayara","051006","AYACUCHO","VÍCTOR FAJARDO","CAYARA","05","10","06"]
[null,"05 Ayacucho","10 Víctor Fajardo","07 Colca","05","10","07","Ayacucho","Víctor Fajardo","Colca","051007","AYACUCHO","VÍCTOR FAJARDO","COLCA","05","10","07"]
[null,"05 Ayacucho","10 Víctor Fajardo","08 Huamanquiquia","05","10","08","Ayacucho","Víctor Fajardo","Huamanquiquia","051008","AYACUCHO","VÍCTOR FAJARDO","HUAMANQUIQUIA","05","10","08"]
[null,"05 Ayacucho","10 Víctor Fajardo","09 Huancaraylla","05","10","09","Ayacucho","Víctor Fajardo","Huancaraylla","051009","AYACUCHO","VÍCTOR FAJARDO","HUANCARAYLLA","05","10","09"]
[null,"05 Ayacucho","10 Víctor Fajardo","10 Hualla","05","10","10","Ayacucho","Víctor Fajardo","Hualla","051010","AYACUCHO","VÍCTOR FAJARDO","HUALLA","05","10","10"]
[null,"05 Ayacucho","10 Víctor Fajardo","11 Sarhua","05","10","11","Ayacucho","Víctor Fajardo","Sarhua","051011","AYACUCHO","VÍCTOR FAJARDO","SARHUA","05","10","11"]
[null,"05 Ayacucho","10 Víctor Fajardo","12 Vilcanchos","05","10","12","Ayacucho","Víctor Fajardo","Vilcanchos","051012","AYACUCHO","VÍCTOR FAJARDO","VILCANCHOS","05","10","12"]
[null,"05 Ayacucho","11 Vilcas Huamán","01 Vilcas Huaman","05","11","01","Ayacucho","Vilcas Huamán","Vilcas Huaman","051101","AYACUCHO","VILCAS HUAMÁN","VILCAS HUAMAN","05","11","01"]
[null,"05 Ayacucho","11 Vilcas Huamán","02 Accomarca","05","11","02","Ayacucho","Vilcas Huamán","Accomarca","051102","AYACUCHO","VILCAS HUAMÁN","ACCOMARCA","05","11","02"]
[null,"05 Ayacucho","11 Vilcas Huamán","03 Carhuanca","05","11","03","Ayacucho","Vilcas Huamán","Carhuanca","051103","AYACUCHO","VILCAS HUAMÁN","CARHUANCA","05","11","03"]
[null,"05 Ayacucho","11 Vilcas Huamán","04 Concepción","05","11","04","Ayacucho","Vilcas Huamán","Concepción","051104","AYACUCHO","VILCAS HUAMÁN","CONCEPCIÓN","05","11","04"]
[null,"05 Ayacucho","11 Vilcas Huamán","05 Huambalpa","05","11","05","Ayacucho","Vilcas Huamán","Huambalpa","051105","AYACUCHO","VILCAS HUAMÁN","HUAMBALPA","05","11","05"]
[null,"05 Ayacucho","11 Vilcas Huamán","06 Independencia","05","11","06","Ayacucho","Vilcas Huamán","Independencia","051106","AYACUCHO","VILCAS HUAMÁN","INDEPENDENCIA","05","11","06"]
[null,"05 Ayacucho","11 Vilcas Huamán","07 Saurama","05","11","07","Ayacucho","Vilcas Huamán","Saurama","051107","AYACUCHO","VILCAS HUAMÁN","SAURAMA","05","11","07"]
[null,"05 Ayacucho","11 Vilcas Huamán","08 Vischongo","05","11","08","Ayacucho","Vilcas Huamán","Vischongo","051108","AYACUCHO","VILCAS HUAMÁN","VISCHONGO","05","11","08"]
[null,"06 Cajamarca","01 Cajamarca","01 Cajamarca","06","01","01","Cajamarca","Cajamarca","Cajamarca","060101","CAJAMARCA","CAJAMARCA","CAJAMARCA","06","01","01"]
[null,"06 Cajamarca","01 Cajamarca","02 Asunción","06","01","02","Cajamarca","Cajamarca","Asunción","060102","CAJAMARCA","CAJAMARCA","ASUNCIÓN","06","01","02"]
[null,"06 Cajamarca","01 Cajamarca","03 Chetilla","06","01","03","Cajamarca","Cajamarca","Chetilla","060103","CAJAMARCA","CAJAMARCA","CHETILLA","06","01","03"]
[null,"06 Cajamarca","01 Cajamarca","04 Cospan","06","01","04","Cajamarca","Cajamarca","Cospan","060104","CAJAMARCA","CAJAMARCA","COSPAN","06","01","04"]
[null,"06 Cajamarca","01 Cajamarca","05 Encañada","06","01","05","Cajamarca","Cajamarca","Encañada","060105","CAJAMARCA","CAJAMARCA","ENCAÑADA","06","01","05"]
[null,"06 Cajamarca","01 Cajamarca","06 Jesús","06","01","06","Cajamarca","Cajamarca","Jesús","060106","CAJAMARCA","CAJAMARCA","JESÚS","06","01","06"]
[null,"06 Cajamarca","01 Cajamarca","07 Llacanora","06","01","07","Cajamarca","Cajamarca","Llacanora","060107","CAJAMARCA","CAJAMARCA","LLACANORA","06","01","07"]
[null,"06 Cajamarca","01 Cajamarca","08 Los Baños del Inca","06","01","08","Cajamarca","Cajamarca","Los Baños del Inca","060108","CAJAMARCA","CAJAMARCA","LOS BAÑOS DEL INCA","06","01","08"]
[null,"06 Cajamarca","01 Cajamarca","09 Magdalena","06","01","09","Cajamarca","Cajamarca","Magdalena","060109","CAJAMARCA","CAJAMARCA","MAGDALENA","06","01","09"]
[null,"06 Cajamarca","01 Cajamarca","10 Matara","06","01","10","Cajamarca","Cajamarca","Matara","060110","CAJAMARCA","CAJAMARCA","MATARA","06","01","10"]
[null,"06 Cajamarca","01 Cajamarca","11 Namora","06","01","11","Cajamarca","Cajamarca","Namora","060111","CAJAMARCA","CAJAMARCA","NAMORA","06","01","11"]
[null,"06 Cajamarca","01 Cajamarca","12 San Juan","06","01","12","Cajamarca","Cajamarca","San Juan","060112","CAJAMARCA","CAJAMARCA","SAN JUAN","06","01","12"]
[null,"06 Cajamarca","02 Cajabamba","01 Cajabamba","06","02","01","Cajamarca","Cajabamba","Cajabamba","060201","CAJAMARCA","CAJABAMBA","CAJABAMBA","06","02","01"]
[null,"06 Cajamarca","02 Cajabamba","02 Cachachi","06","02","02","Cajamarca","Cajabamba","Cachachi","060202","CAJAMARCA","CAJABAMBA","CACHACHI","06","02","02"]
[null,"06 Cajamarca","02 Cajabamba","03 Condebamba",{"$f":"+MID(B580,1,2)","v":"06"},"02","03","Cajamarca","Cajabamba","Condebamba",{"$f":"+CONCATENATE(E580,F580,G580)","v":"060203"},"CAJAMARCA","CAJABAMBA","CONDEBAMBA","06","02","03"]
[null,"06 Cajamarca","02 Cajabamba","04 Sitacocha","06","02","04","Cajamarca","Cajabamba","Sitacocha","060204","CAJAMARCA","CAJABAMBA","SITACOCHA","06","02","04"]
[null,"06 Cajamarca","03 Celendín","01 Celendín","06","03","01","Cajamarca","Celendín","Celendín","060301","CAJAMARCA","CELENDÍN","CELENDÍN","06","03","01"]
[null,"06 Cajamarca","03 Celendín","02 Chumuch","06","03","02","Cajamarca","Celendín","Chumuch","060302","CAJAMARCA","CELENDÍN","CHUMUCH","06","03","02"]
[null,"06 Cajamarca","03 Celendín","03 Cortegana","06","03","03","Cajamarca","Celendín","Cortegana","060303","CAJAMARCA","CELENDÍN","CORTEGANA","06","03","03"]
[null,"06 Cajamarca","03 Celendín","04 Huasmin","06","03","04","Cajamarca","Celendín","Huasmin","060304","CAJAMARCA","CELENDÍN","HUASMIN","06","03","04"]
[null,"06 Cajamarca","03 Celendín","05 Jorge Chávez","06","03","05","Cajamarca","Celendín","Jorge Chávez","060305","CAJAMARCA","CELENDÍN","JORGE CHÁVEZ","06","03","05"]
[null,"06 Cajamarca","03 Celendín","06 José Gálvez","06","03","06","Cajamarca","Celendín","José Gálvez","060306","CAJAMARCA","CELENDÍN","JOSÉ GÁLVEZ","06","03","06"]
[null,"06 Cajamarca","03 Celendín","07 Miguel Iglesias","06","03","07","Cajamarca","Celendín","Miguel Iglesias","060307","CAJAMARCA","CELENDÍN","MIGUEL IGLESIAS","06","03","07"]
[null,"06 Cajamarca","03 Celendín","08 Oxamarca","06","03","08","Cajamarca","Celendín","Oxamarca","060308","CAJAMARCA","CELENDÍN","OXAMARCA","06","03","08"]
[null,"06 Cajamarca","03 Celendín","09 Sorochuco","06","03","09","Cajamarca","Celendín","Sorochuco","060309","CAJAMARCA","CELENDÍN","SOROCHUCO","06","03","09"]
[null,"06 Cajamarca","03 Celendín","10 Sucre","06","03","10","Cajamarca","Celendín","Sucre","060310","CAJAMARCA","CELENDÍN","SUCRE","06","03","10"]
[null,"06 Cajamarca","03 Celendín","11 Utco","06","03","11","Cajamarca","Celendín","Utco","060311","CAJAMARCA","CELENDÍN","UTCO","06","03","11"]
[null,"06 Cajamarca","03 Celendín","12 La Libertad de Pallan","06","03","12","Cajamarca","Celendín","La Libertad de Pallan","060312","CAJAMARCA","CELENDÍN","LA LIBERTAD DE PALLAN","06","03","12"]
[null,"06 Cajamarca","04 Chota","01 Chota","06","04","01","Cajamarca","Chota","Chota","060401","CAJAMARCA","CHOTA","CHOTA","06","04","01"]
[null,"06 Cajamarca","04 Chota","02 Anguia","06","04","02","Cajamarca","Chota","Anguia","060402","CAJAMARCA","CHOTA","ANGUIA","06","04","02"]
[null,"06 Cajamarca","04 Chota","03 Chadin","06","04","03","Cajamarca","Chota","Chadin","060403","CAJAMARCA","CHOTA","CHADIN","06","04","03"]
[null,"06 Cajamarca","04 Chota","04 Chiguirip","06","04","04","Cajamarca","Chota","Chiguirip","060404","CAJAMARCA","CHOTA","CHIGUIRIP","06","04","04"]
[null,"06 Cajamarca","04 Chota","05 Chimban","06","04","05","Cajamarca","Chota","Chimban","060405","CAJAMARCA","CHOTA","CHIMBAN","06","04","05"]
[null,"06 Cajamarca","04 Chota","06 Choropampa","06","04","06","Cajamarca","Chota","Choropampa","060406","CAJAMARCA","CHOTA","CHOROPAMPA","06","04","06"]
[null,"06 Cajamarca","04 Chota","07 Cochabamba","06","04","07","Cajamarca","Chota","Cochabamba","060407","CAJAMARCA","CHOTA","COCHABAMBA","06","04","07"]
[null,"06 Cajamarca","04 Chota","08 Conchan","06","04","08","Cajamarca","Chota","Conchan","060408","CAJAMARCA","CHOTA","CONCHAN","06","04","08"]
[null,"06 Cajamarca","04 Chota","09 Huambos","06","04","09","Cajamarca","Chota","Huambos","060409","CAJAMARCA","CHOTA","HUAMBOS","06","04","09"]
[null,"06 Cajamarca","04 Chota","10 Lajas","06","04","10","Cajamarca","Chota","Lajas","060410","CAJAMARCA","CHOTA","LAJAS","06","04","10"]
[null,"06 Cajamarca","04 Chota","11 Llama","06","04","11","Cajamarca","Chota","Llama","060411","CAJAMARCA","CHOTA","LLAMA","06","04","11"]
[null,"06 Cajamarca","04 Chota","12 Miracosta","06","04","12","Cajamarca","Chota","Miracosta","060412","CAJAMARCA","CHOTA","MIRACOSTA","06","04","12"]
[null,"06 Cajamarca","04 Chota","13 Paccha","06","04","13","Cajamarca","Chota","Paccha","060413","CAJAMARCA","CHOTA","PACCHA","06","04","13"]
[null,"06 Cajamarca","04 Chota","14 Pion","06","04","14","Cajamarca","Chota","Pion","060414","CAJAMARCA","CHOTA","PION","06","04","14"]
[null,"06 Cajamarca","04 Chota","15 Querocoto","06","04","15","Cajamarca","Chota","Querocoto","060415","CAJAMARCA","CHOTA","QUEROCOTO","06","04","15"]
[null,"06 Cajamarca","04 Chota","16 San Juan de Licupis","06","04","16","Cajamarca","Chota","San Juan de Licupis","060416","CAJAMARCA","CHOTA","SAN JUAN DE LICUPIS","06","04","16"]
[null,"06 Cajamarca","04 Chota","17 Tacabamba","06","04","17","Cajamarca","Chota","Tacabamba","060417","CAJAMARCA","CHOTA","TACABAMBA","06","04","17"]
[null,"06 Cajamarca","04 Chota","18 Tocmoche","06","04","18","Cajamarca","Chota","Tocmoche","060418","CAJAMARCA","CHOTA","TOCMOCHE","06","04","18"]
[null,"06 Cajamarca","04 Chota","19 Chalamarca","06","04","19","Cajamarca","Chota","Chalamarca","060419","CAJAMARCA","CHOTA","CHALAMARCA","06","04","19"]
[null,"06 Cajamarca","05 Contumazá","01 Contumaza","06","05","01","Cajamarca","Contumazá","Contumaza","060501","CAJAMARCA","CONTUMAZÁ","CONTUMAZA","06","05","01"]
[null,"06 Cajamarca","05 Contumazá","02 Chilete","06","05","02","Cajamarca","Contumazá","Chilete","060502","CAJAMARCA","CONTUMAZÁ","CHILETE","06","05","02"]
[null,"06 Cajamarca","05 Contumazá","03 Cupisnique","06","05","03","Cajamarca","Contumazá","Cupisnique","060503","CAJAMARCA","CONTUMAZÁ","CUPISNIQUE","06","05","03"]
[null,"06 Cajamarca","05 Contumazá","04 Guzmango","06","05","04","Cajamarca","Contumazá","Guzmango","060504","CAJAMARCA","CONTUMAZÁ","GUZMANGO","06","05","04"]
[null,"06 Cajamarca","05 Contumazá","05 San Benito","06","05","05","Cajamarca","Contumazá","San Benito","060505","CAJAMARCA","CONTUMAZÁ","SAN BENITO","06","05","05"]
[null,"06 Cajamarca","05 Contumazá","06 Santa Cruz de Toledo","06","05","06","Cajamarca","Contumazá","Santa Cruz de Toledo","060506","CAJAMARCA","CONTUMAZÁ","SANTA CRUZ DE TOLEDO","06","05","06"]
[null,"06 Cajamarca","05 Contumazá","07 Tantarica","06","05","07","Cajamarca","Contumazá","Tantarica","060507","CAJAMARCA","CONTUMAZÁ","TANTARICA","06","05","07"]
[null,"06 Cajamarca","05 Contumazá","08 Yonan","06","05","08","Cajamarca","Contumazá","Yonan","060508","CAJAMARCA","CONTUMAZÁ","YONAN","06","05","08"]
[null,"06 Cajamarca","06 Cutervo","01 Cutervo","06","06","01","Cajamarca","Cutervo","Cutervo","060601","CAJAMARCA","CUTERVO","CUTERVO","06","06","01"]
[null,"06 Cajamarca","06 Cutervo","02 Callayuc","06","06","02","Cajamarca","Cutervo","Callayuc","060602","CAJAMARCA","CUTERVO","CALLAYUC","06","06","02"]
[null,"06 Cajamarca","06 Cutervo","03 Choros","06","06","03","Cajamarca","Cutervo","Choros","060603","CAJAMARCA","CUTERVO","CHOROS","06","06","03"]
[null,"06 Cajamarca","06 Cutervo","04 Cujillo","06","06","04","Cajamarca","Cutervo","Cujillo","060604","CAJAMARCA","CUTERVO","CUJILLO","06","06","04"]
[null,"06 Cajamarca","06 Cutervo","05 La Ramada","06","06","05","Cajamarca","Cutervo","La Ramada","060605","CAJAMARCA","CUTERVO","LA RAMADA","06","06","05"]
[null,"06 Cajamarca","06 Cutervo","06 Pimpingos","06","06","06","Cajamarca","Cutervo","Pimpingos","060606","CAJAMARCA","CUTERVO","PIMPINGOS","06","06","06"]
[null,"06 Cajamarca","06 Cutervo","07 Querocotillo","06","06","07","Cajamarca","Cutervo","Querocotillo","060607","CAJAMARCA","CUTERVO","QUEROCOTILLO","06","06","07"]
[null,"06 Cajamarca","06 Cutervo","08 San Andrés de Cutervo","06","06","08","Cajamarca","Cutervo","San Andrés de Cutervo","060608","CAJAMARCA","CUTERVO","SAN ANDRÉS DE CUTERVO","06","06","08"]
[null,"06 Cajamarca","06 Cutervo","09 San Juan de Cutervo","06","06","09","Cajamarca","Cutervo","San Juan de Cutervo","060609","CAJAMARCA","CUTERVO","SAN JUAN DE CUTERVO","06","06","09"]
[null,"06 Cajamarca","06 Cutervo","10 San Luis de Lucma","06","06","10","Cajamarca","Cutervo","San Luis de Lucma","060610","CAJAMARCA","CUTERVO","SAN LUIS DE LUCMA","06","06","10"]
[null,"06 Cajamarca","06 Cutervo","11 Santa Cruz","06","06","11","Cajamarca","Cutervo","Santa Cruz","060611","CAJAMARCA","CUTERVO","SANTA CRUZ","06","06","11"]
[null,"06 Cajamarca","06 Cutervo","12 Santo Domingo de la Capilla","06","06","12","Cajamarca","Cutervo","Santo Domingo de la Capilla","060612","CAJAMARCA","CUTERVO","SANTO DOMINGO DE LA CAPILLA","06","06","12"]
[null,"06 Cajamarca","06 Cutervo","13 Santo Tomas","06","06","13","Cajamarca","Cutervo","Santo Tomas","060613","CAJAMARCA","CUTERVO","SANTO TOMAS","06","06","13"]
[null,"06 Cajamarca","06 Cutervo","14 Socota","06","06","14","Cajamarca","Cutervo","Socota","060614","CAJAMARCA","CUTERVO","SOCOTA","06","06","14"]
[null,"06 Cajamarca","06 Cutervo","15 Toribio Casanova","06","06","15","Cajamarca","Cutervo","Toribio Casanova","060615","CAJAMARCA","CUTERVO","TORIBIO CASANOVA","06","06","15"]
[null,"06 Cajamarca","07 Hualgayoc","01 Bambamarca","06","07","01","Cajamarca","Hualgayoc","Bambamarca","060701","CAJAMARCA","HUALGAYOC","BAMBAMARCA","06","07","01"]
[null,"06 Cajamarca","07 Hualgayoc","02 Chugur","06","07","02","Cajamarca","Hualgayoc","Chugur","060702","CAJAMARCA","HUALGAYOC","CHUGUR","06","07","02"]
[null,"06 Cajamarca","07 Hualgayoc","03 Hualgayoc","06","07","03","Cajamarca","Hualgayoc","Hualgayoc","060703","CAJAMARCA","HUALGAYOC","HUALGAYOC","06","07","03"]
[null,"06 Cajamarca","08 Jaén","01 Jaén","06","08","01","Cajamarca","Jaén","Jaén","060801","CAJAMARCA","JAÉN","JAÉN","06","08","01"]
[null,"06 Cajamarca","08 Jaén","02 Bellavista","06","08","02","Cajamarca","Jaén","Bellavista","060802","CAJAMARCA","JAÉN","BELLAVISTA","06","08","02"]
[null,"06 Cajamarca","08 Jaén","03 Chontali","06","08","03","Cajamarca","Jaén","Chontali","060803","CAJAMARCA","JAÉN","CHONTALI","06","08","03"]
[null,"06 Cajamarca","08 Jaén","04 Colasay","06","08","04","Cajamarca","Jaén","Colasay","060804","CAJAMARCA","JAÉN","COLASAY","06","08","04"]
[null,"06 Cajamarca","08 Jaén","05 Huabal","06","08","05","Cajamarca","Jaén","Huabal","060805","CAJAMARCA","JAÉN","HUABAL","06","08","05"]
[null,"06 Cajamarca","08 Jaén","06 Las Pirias",{"$f":"+MID(B644,1,2)","v":"06"},"08","06","Cajamarca","Jaén","Las Pirias",{"$f":"+CONCATENATE(E644,F644,G644)","v":"060806"},"CAJAMARCA","JAÉN","LAS PIRIAS","06","08","06"]
[null,"06 Cajamarca","08 Jaén","07 Pomahuaca","06","08","07","Cajamarca","Jaén","Pomahuaca","060807","CAJAMARCA","JAÉN","POMAHUACA","06","08","07"]
[null,"06 Cajamarca","08 Jaén","08 Pucara","06","08","08","Cajamarca","Jaén","Pucara","060808","CAJAMARCA","JAÉN","PUCARA","06","08","08"]
[null,"06 Cajamarca","08 Jaén","09 Sallique","06","08","09","Cajamarca","Jaén","Sallique","060809","CAJAMARCA","JAÉN","SALLIQUE","06","08","09"]
[null,"06 Cajamarca","08 Jaén","10 San Felipe","06","08","10","Cajamarca","Jaén","San Felipe","060810","CAJAMARCA","JAÉN","SAN FELIPE","06","08","10"]
[null,"06 Cajamarca","08 Jaén","11 San José del Alto","06","08","11","Cajamarca","Jaén","San José del Alto","060811","CAJAMARCA","JAÉN","SAN JOSÉ DEL ALTO","06","08","11"]
[null,"06 Cajamarca","08 Jaén","12 Santa Rosa","06","08","12","Cajamarca","Jaén","Santa Rosa","060812","CAJAMARCA","JAÉN","SANTA ROSA","06","08","12"]
[null,"06 Cajamarca","09 San Ignacio","01 San Ignacio","06","09","01","Cajamarca","San Ignacio","San Ignacio","060901","CAJAMARCA","SAN IGNACIO","SAN IGNACIO","06","09","01"]
[null,"06 Cajamarca","09 San Ignacio","02 Chirinos","06","09","02","Cajamarca","San Ignacio","Chirinos","060902","CAJAMARCA","SAN IGNACIO","CHIRINOS","06","09","02"]
[null,"06 Cajamarca","09 San Ignacio","03 Huarango","06","09","03","Cajamarca","San Ignacio","Huarango","060903","CAJAMARCA","SAN IGNACIO","HUARANGO","06","09","03"]
[null,"06 Cajamarca","09 San Ignacio","04 La Coipa","06","09","04","Cajamarca","San Ignacio","La Coipa","060904","CAJAMARCA","SAN IGNACIO","LA COIPA","06","09","04"]
[null,"06 Cajamarca","09 San Ignacio","05 Namballe","06","09","05","Cajamarca","San Ignacio","Namballe","060905","CAJAMARCA","SAN IGNACIO","NAMBALLE","06","09","05"]
[null,"06 Cajamarca","09 San Ignacio","06 San José de Lourdes","06","09","06","Cajamarca","San Ignacio","San José de Lourdes","060906","CAJAMARCA","SAN IGNACIO","SAN JOSÉ DE LOURDES","06","09","06"]
[null,"06 Cajamarca","09 San Ignacio","07 Tabaconas","06","09","07","Cajamarca","San Ignacio","Tabaconas","060907","CAJAMARCA","SAN IGNACIO","TABACONAS","06","09","07"]
[null,"06 Cajamarca","10 San Marcos","01 Pedro Gálvez","06","10","01","Cajamarca","San Marcos","Pedro Gálvez","061001","CAJAMARCA","SAN MARCOS","PEDRO GÁLVEZ","06","10","01"]
[null,"06 Cajamarca","10 San Marcos","02 Chancay","06","10","02","Cajamarca","San Marcos","Chancay","061002","CAJAMARCA","SAN MARCOS","CHANCAY","06","10","02"]
[null,"06 Cajamarca","10 San Marcos","03 Eduardo Villanueva","06","10","03","Cajamarca","San Marcos","Eduardo Villanueva","061003","CAJAMARCA","SAN MARCOS","EDUARDO VILLANUEVA","06","10","03"]
[null,"06 Cajamarca","10 San Marcos","04 Gregorio Pita","06","10","04","Cajamarca","San Marcos","Gregorio Pita","061004","CAJAMARCA","SAN MARCOS","GREGORIO PITA","06","10","04"]
[null,"06 Cajamarca","10 San Marcos","05 Ichocan","06","10","05","Cajamarca","San Marcos","Ichocan","061005","CAJAMARCA","SAN MARCOS","ICHOCAN","06","10","05"]
[null,"06 Cajamarca","10 San Marcos","06 José Manuel Quiroz","06","10","06","Cajamarca","San Marcos","José Manuel Quiroz","061006","CAJAMARCA","SAN MARCOS","JOSÉ MANUEL QUIROZ","06","10","06"]
[null,"06 Cajamarca","10 San Marcos","07 José Sabogal","06","10","07","Cajamarca","San Marcos","José Sabogal","061007","CAJAMARCA","SAN MARCOS","JOSÉ SABOGAL","06","10","07"]
[null,"06 Cajamarca","11 San Miguel","01 San Miguel","06","11","01","Cajamarca","San Miguel","San Miguel","061101","CAJAMARCA","SAN MIGUEL","SAN MIGUEL","06","11","01"]
[null,"06 Cajamarca","11 San Miguel","02 Bolívar","06","11","02","Cajamarca","San Miguel","Bolívar","061102","CAJAMARCA","SAN MIGUEL","BOLÍVAR","06","11","02"]
[null,"06 Cajamarca","11 San Miguel","03 Calquis","06","11","03","Cajamarca","San Miguel","Calquis","061103","CAJAMARCA","SAN MIGUEL","CALQUIS","06","11","03"]
[null,"06 Cajamarca","11 San Miguel","04 Catilluc","06","11","04","Cajamarca","San Miguel","Catilluc","061104","CAJAMARCA","SAN MIGUEL","CATILLUC","06","11","04"]
[null,"06 Cajamarca","11 San Miguel","05 El Prado","06","11","05","Cajamarca","San Miguel","El Prado","061105","CAJAMARCA","SAN MIGUEL","EL PRADO","06","11","05"]
[null,"06 Cajamarca","11 San Miguel","06 La Florida","06","11","06","Cajamarca","San Miguel","La Florida","061106","CAJAMARCA","SAN MIGUEL","LA FLORIDA","06","11","06"]
[null,"06 Cajamarca","11 San Miguel","07 Llapa","06","11","07","Cajamarca","San Miguel","Llapa","061107","CAJAMARCA","SAN MIGUEL","LLAPA","06","11","07"]
[null,"06 Cajamarca","11 San Miguel","08 Nanchoc","06","11","08","Cajamarca","San Miguel","Nanchoc","061108","CAJAMARCA","SAN MIGUEL","NANCHOC","06","11","08"]
[null,"06 Cajamarca","11 San Miguel","09 Niepos","06","11","09","Cajamarca","San Miguel","Niepos","061109","CAJAMARCA","SAN MIGUEL","NIEPOS","06","11","09"]
[null,"06 Cajamarca","11 San Miguel","10 San Gregorio","06","11","10","Cajamarca","San Miguel","San Gregorio","061110","CAJAMARCA","SAN MIGUEL","SAN GREGORIO","06","11","10"]
[null,"06 Cajamarca","11 San Miguel","11 San Silvestre de Cochan","06","11","11","Cajamarca","San Miguel","San Silvestre de Cochan","061111","CAJAMARCA","SAN MIGUEL","SAN SILVESTRE DE COCHAN","06","11","11"]
[null,"06 Cajamarca","11 San Miguel","12 Tongod","06","11","12","Cajamarca","San Miguel","Tongod","061112","CAJAMARCA","SAN MIGUEL","TONGOD","06","11","12"]
[null,"06 Cajamarca","11 San Miguel","13 Unión Agua Blanca","06","11","13","Cajamarca","San Miguel","Unión Agua Blanca","061113","CAJAMARCA","SAN MIGUEL","UNIÓN AGUA BLANCA","06","11","13"]
[null,"06 Cajamarca","12 San Pablo","01 San Pablo","06","12","01","Cajamarca","San Pablo","San Pablo","061201","CAJAMARCA","SAN PABLO","SAN PABLO","06","12","01"]
[null,"06 Cajamarca","12 San Pablo","02 San Bernardino","06","12","02","Cajamarca","San Pablo","San Bernardino","061202","CAJAMARCA","SAN PABLO","SAN BERNARDINO","06","12","02"]
[null,"06 Cajamarca","12 San Pablo","03 San Luis","06","12","03","Cajamarca","San Pablo","San Luis","061203","CAJAMARCA","SAN PABLO","SAN LUIS","06","12","03"]
[null,"06 Cajamarca","12 San Pablo","04 Tumbaden","06","12","04","Cajamarca","San Pablo","Tumbaden","061204","CAJAMARCA","SAN PABLO","TUMBADEN","06","12","04"]
[null,"06 Cajamarca","13 Santa Cruz","01 Santa Cruz","06","13","01","Cajamarca","Santa Cruz","Santa Cruz","061301","CAJAMARCA","SANTA CRUZ","SANTA CRUZ","06","13","01"]
[null,"06 Cajamarca","13 Santa Cruz","02 Andabamba","06","13","02","Cajamarca","Santa Cruz","Andabamba","061302","CAJAMARCA","SANTA CRUZ","ANDABAMBA","06","13","02"]
[null,"06 Cajamarca","13 Santa Cruz","03 Catache","06","13","03","Cajamarca","Santa Cruz","Catache","061303","CAJAMARCA","SANTA CRUZ","CATACHE","06","13","03"]
[null,"06 Cajamarca","13 Santa Cruz","04 Chancaybaños","06","13","04","Cajamarca","Santa Cruz","Chancaybaños","061304","CAJAMARCA","SANTA CRUZ","CHANCAYBAÑOS","06","13","04"]
[null,"06 Cajamarca","13 Santa Cruz","05 La Esperanza","06","13","05","Cajamarca","Santa Cruz","La Esperanza","061305","CAJAMARCA","SANTA CRUZ","LA ESPERANZA","06","13","05"]
[null,"06 Cajamarca","13 Santa Cruz","06 Ninabamba","06","13","06","Cajamarca","Santa Cruz","Ninabamba","061306","CAJAMARCA","SANTA CRUZ","NINABAMBA","06","13","06"]
[null,"06 Cajamarca","13 Santa Cruz","07 Pulan","06","13","07","Cajamarca","Santa Cruz","Pulan","061307","CAJAMARCA","SANTA CRUZ","PULAN","06","13","07"]
[null,"06 Cajamarca","13 Santa Cruz","08 Saucepampa","06","13","08","Cajamarca","Santa Cruz","Saucepampa","061308","CAJAMARCA","SANTA CRUZ","SAUCEPAMPA","06","13","08"]
[null,"06 Cajamarca","13 Santa Cruz","09 Sexi","06","13","09","Cajamarca","Santa Cruz","Sexi","061309","CAJAMARCA","SANTA CRUZ","SEXI","06","13","09"]
[null,"06 Cajamarca","13 Santa Cruz","10 Uticyacu","06","13","10","Cajamarca","Santa Cruz","Uticyacu","061310","CAJAMARCA","SANTA CRUZ","UTICYACU","06","13","10"]
[null,"06 Cajamarca","13 Santa Cruz","11 Yauyucan","06","13","11","Cajamarca","Santa Cruz","Yauyucan","061311","CAJAMARCA","SANTA CRUZ","YAUYUCAN","06","13","11"]
[null,"08 Cusco","01 Cusco","01 Cusco","08","01","01","Cusco","Cusco","Cusco","080101","CUSCO","CUSCO","CUSCO","08","01","01"]
[null,"08 Cusco","01 Cusco","02 Ccorca","08","01","02","Cusco","Cusco","Ccorca","080102","CUSCO","CUSCO","CCORCA","08","01","02"]
[null,"08 Cusco","01 Cusco","03 Poroy","08","01","03","Cusco","Cusco","Poroy","080103","CUSCO","CUSCO","POROY","08","01","03"]
[null,"08 Cusco","01 Cusco","04 San Jerónimo","08","01","04","Cusco","Cusco","San Jerónimo","080104","CUSCO","CUSCO","SAN JERÓNIMO","08","01","04"]
[null,"08 Cusco","01 Cusco","05 San Sebastian","08","01","05","Cusco","Cusco","San Sebastian","080105","CUSCO","CUSCO","SAN SEBASTIAN","08","01","05"]
[null,"08 Cusco","01 Cusco","06 Santiago","08","01","06","Cusco","Cusco","Santiago","080106","CUSCO","CUSCO","SANTIAGO","08","01","06"]
[null,"08 Cusco","01 Cusco","07 Saylla","08","01","07","Cusco","Cusco","Saylla","080107","CUSCO","CUSCO","SAYLLA","08","01","07"]
[null,"08 Cusco","01 Cusco","08 Wanchaq","08","01","08","Cusco","Cusco","Wanchaq","080108","CUSCO","CUSCO","WANCHAQ","08","01","08"]
[null,"08 Cusco","02 Acomayo","01 Acomayo","08","02","01","Cusco","Acomayo","Acomayo","080201","CUSCO","ACOMAYO","ACOMAYO","08","02","01"]
[null,"08 Cusco","02 Acomayo","02 Acopia","08","02","02","Cusco","Acomayo","Acopia","080202","CUSCO","ACOMAYO","ACOPIA","08","02","02"]
[null,"08 Cusco","02 Acomayo","03 Acos","08","02","03","Cusco","Acomayo","Acos","080203","CUSCO","ACOMAYO","ACOS","08","02","03"]
[null,"08 Cusco","02 Acomayo","04 Mosoc Llacta","08","02","04","Cusco","Acomayo","Mosoc Llacta","080204","CUSCO","ACOMAYO","MOSOC LLACTA","08","02","04"]
[null,"08 Cusco","02 Acomayo","05 Pomacanchi","08","02","05","Cusco","Acomayo","Pomacanchi","080205","CUSCO","ACOMAYO","POMACANCHI","08","02","05"]
[null,"08 Cusco","02 Acomayo","06 Rondocan","08","02","06","Cusco","Acomayo","Rondocan","080206","CUSCO","ACOMAYO","RONDOCAN","08","02","06"]
[null,"08 Cusco","02 Acomayo","07 Sangarara","08","02","07","Cusco","Acomayo","Sangarara","080207","CUSCO","ACOMAYO","SANGARARA","08","02","07"]
[null,"08 Cusco","03 Anta","01 Anta",{"$f":"+MID(B708,1,2)","v":"08"},"03","01","Cusco","Anta","Anta",{"$f":"+CONCATENATE(E708,F708,G708)","v":"080301"},"CUSCO","ANTA","ANTA","08","03","01"]
[null,"08 Cusco","03 Anta","02 Ancahuasi","08","03","02","Cusco","Anta","Ancahuasi","080302","CUSCO","ANTA","ANCAHUASI","08","03","02"]
[null,"08 Cusco","03 Anta","03 Cachimayo","08","03","03","Cusco","Anta","Cachimayo","080303","CUSCO","ANTA","CACHIMAYO","08","03","03"]
[null,"08 Cusco","03 Anta","04 Chinchaypujio","08","03","04","Cusco","Anta","Chinchaypujio","080304","CUSCO","ANTA","CHINCHAYPUJIO","08","03","04"]
[null,"08 Cusco","03 Anta","05 Huarocondo","08","03","05","Cusco","Anta","Huarocondo","080305","CUSCO","ANTA","HUAROCONDO","08","03","05"]
[null,"08 Cusco","03 Anta","06 Limatambo","08","03","06","Cusco","Anta","Limatambo","080306","CUSCO","ANTA","LIMATAMBO","08","03","06"]
[null,"08 Cusco","03 Anta","07 Mollepata","08","03","07","Cusco","Anta","Mollepata","080307","CUSCO","ANTA","MOLLEPATA","08","03","07"]
[null,"08 Cusco","03 Anta","08 Pucyura","08","03","08","Cusco","Anta","Pucyura","080308","CUSCO","ANTA","PUCYURA","08","03","08"]
[null,"08 Cusco","03 Anta","09 Zurite","08","03","09","Cusco","Anta","Zurite","080309","CUSCO","ANTA","ZURITE","08","03","09"]
[null,"08 Cusco","04 Calca","01 Calca","08","04","01","Cusco","Calca","Calca","080401","CUSCO","CALCA","CALCA","08","04","01"]
[null,"08 Cusco","04 Calca","02 Coya","08","04","02","Cusco","Calca","Coya","080402","CUSCO","CALCA","COYA","08","04","02"]
[null,"08 Cusco","04 Calca","03 Lamay","08","04","03","Cusco","Calca","Lamay","080403","CUSCO","CALCA","LAMAY","08","04","03"]
[null,"08 Cusco","04 Calca","04 Lares","08","04","04","Cusco","Calca","Lares","080404","CUSCO","CALCA","LARES","08","04","04"]
[null,"08 Cusco","04 Calca","05 Pisac","08","04","05","Cusco","Calca","Pisac","080405","CUSCO","CALCA","PISAC","08","04","05"]
[null,"08 Cusco","04 Calca","06 San Salvador","08","04","06","Cusco","Calca","San Salvador","080406","CUSCO","CALCA","SAN SALVADOR","08","04","06"]
[null,"08 Cusco","04 Calca","07 Taray","08","04","07","Cusco","Calca","Taray","080407","CUSCO","CALCA","TARAY","08","04","07"]
[null,"08 Cusco","04 Calca","08 Yanatile","08","04","08","Cusco","Calca","Yanatile","080408","CUSCO","CALCA","YANATILE","08","04","08"]
[null,"08 Cusco","05 Canas","01 Yanaoca","08","05","01","Cusco","Canas","Yanaoca","080501","CUSCO","CANAS","YANAOCA","08","05","01"]
[null,"08 Cusco","05 Canas","02 Checca","08","05","02","Cusco","Canas","Checca","080502","CUSCO","CANAS","CHECCA","08","05","02"]
[null,"08 Cusco","05 Canas","03 Kunturkanki","08","05","03","Cusco","Canas","Kunturkanki","080503","CUSCO","CANAS","KUNTURKANKI","08","05","03"]
[null,"08 Cusco","05 Canas","04 Langui","08","05","04","Cusco","Canas","Langui","080504","CUSCO","CANAS","LANGUI","08","05","04"]
[null,"08 Cusco","05 Canas","05 Layo","08","05","05","Cusco","Canas","Layo","080505","CUSCO","CANAS","LAYO","08","05","05"]
[null,"08 Cusco","05 Canas","06 Pampamarca","08","05","06","Cusco","Canas","Pampamarca","080506","CUSCO","CANAS","PAMPAMARCA","08","05","06"]
[null,"08 Cusco","05 Canas","07 Quehue","08","05","07","Cusco","Canas","Quehue","080507","CUSCO","CANAS","QUEHUE","08","05","07"]
[null,"08 Cusco","05 Canas","08 Tupac Amaru","08","05","08","Cusco","Canas","Tupac Amaru","080508","CUSCO","CANAS","TUPAC AMARU","08","05","08"]
[null,"08 Cusco","06 Canchis","01 Sicuani","08","06","01","Cusco","Canchis","Sicuani","080601","CUSCO","CANCHIS","SICUANI","08","06","01"]
[null,"08 Cusco","06 Canchis","02 Checacupe","08","06","02","Cusco","Canchis","Checacupe","080602","CUSCO","CANCHIS","CHECACUPE","08","06","02"]
[null,"08 Cusco","06 Canchis","03 Combapata","08","06","03","Cusco","Canchis","Combapata","080603","CUSCO","CANCHIS","COMBAPATA","08","06","03"]
[null,"08 Cusco","06 Canchis","04 Marangani","08","06","04","Cusco","Canchis","Marangani","080604","CUSCO","CANCHIS","MARANGANI","08","06","04"]
[null,"08 Cusco","06 Canchis","05 Pitumarca","08","06","05","Cusco","Canchis","Pitumarca","080605","CUSCO","CANCHIS","PITUMARCA","08","06","05"]
[null,"08 Cusco","06 Canchis","06 San Pablo","08","06","06","Cusco","Canchis","San Pablo","080606","CUSCO","CANCHIS","SAN PABLO","08","06","06"]
[null,"08 Cusco","06 Canchis","07 San Pedro","08","06","07","Cusco","Canchis","San Pedro","080607","CUSCO","CANCHIS","SAN PEDRO","08","06","07"]
[null,"08 Cusco","06 Canchis","08 Tinta","08","06","08","Cusco","Canchis","Tinta","080608","CUSCO","CANCHIS","TINTA","08","06","08"]
[null,"08 Cusco","07 Chumbivilcas","01 Santo Tomas","08","07","01","Cusco","Chumbivilcas","Santo Tomas","080701","CUSCO","CHUMBIVILCAS","SANTO TOMAS","08","07","01"]
[null,"08 Cusco","07 Chumbivilcas","02 Capacmarca","08","07","02","Cusco","Chumbivilcas","Capacmarca","080702","CUSCO","CHUMBIVILCAS","CAPACMARCA","08","07","02"]
[null,"08 Cusco","07 Chumbivilcas","03 Chamaca","08","07","03","Cusco","Chumbivilcas","Chamaca","080703","CUSCO","CHUMBIVILCAS","CHAMACA","08","07","03"]
[null,"08 Cusco","07 Chumbivilcas","04 Colquemarca","08","07","04","Cusco","Chumbivilcas","Colquemarca","080704","CUSCO","CHUMBIVILCAS","COLQUEMARCA","08","07","04"]
[null,"08 Cusco","07 Chumbivilcas","05 Livitaca","08","07","05","Cusco","Chumbivilcas","Livitaca","080705","CUSCO","CHUMBIVILCAS","LIVITACA","08","07","05"]
[null,"08 Cusco","07 Chumbivilcas","06 Llusco","08","07","06","Cusco","Chumbivilcas","Llusco","080706","CUSCO","CHUMBIVILCAS","LLUSCO","08","07","06"]
[null,"08 Cusco","07 Chumbivilcas","07 Quiñota","08","07","07","Cusco","Chumbivilcas","Quiñota","080707","CUSCO","CHUMBIVILCAS","QUIÑOTA","08","07","07"]
[null,"08 Cusco","07 Chumbivilcas","08 Velille","08","07","08","Cusco","Chumbivilcas","Velille","080708","CUSCO","CHUMBIVILCAS","VELILLE","08","07","08"]
[null,"08 Cusco","08 Espinar","01 Espinar","08","08","01","Cusco","Espinar","Espinar","080801","CUSCO","ESPINAR","ESPINAR","08","08","01"]
[null,"08 Cusco","08 Espinar","02 Condoroma","08","08","02","Cusco","Espinar","Condoroma","080802","CUSCO","ESPINAR","CONDOROMA","08","08","02"]
[null,"08 Cusco","08 Espinar","03 Coporaque","08","08","03","Cusco","Espinar","Coporaque","080803","CUSCO","ESPINAR","COPORAQUE","08","08","03"]
[null,"08 Cusco","08 Espinar","04 Ocoruro","08","08","04","Cusco","Espinar","Ocoruro","080804","CUSCO","ESPINAR","OCORURO","08","08","04"]
[null,"08 Cusco","08 Espinar","05 Pallpata","08","08","05","Cusco","Espinar","Pallpata","080805","CUSCO","ESPINAR","PALLPATA","08","08","05"]
[null,"08 Cusco","08 Espinar","06 Pichigua","08","08","06","Cusco","Espinar","Pichigua","080806","CUSCO","ESPINAR","PICHIGUA","08","08","06"]
[null,"08 Cusco","08 Espinar","07 Suyckutambo","08","08","07","Cusco","Espinar","Suyckutambo","080807","CUSCO","ESPINAR","SUYCKUTAMBO","08","08","07"]
[null,"08 Cusco","08 Espinar","08 Alto Pichigua","08","08","08","Cusco","Espinar","Alto Pichigua","080808","CUSCO","ESPINAR","ALTO PICHIGUA","08","08","08"]
[null,"08 Cusco","09 La Convención","01 Santa Ana","08","09","01","Cusco","La Convención","Santa Ana","080901","CUSCO","LA CONVENCIÓN","SANTA ANA","08","09","01"]
[null,"08 Cusco","09 La Convención","02 Echarate","08","09","02","Cusco","La Convención","Echarate","080902","CUSCO","LA CONVENCIÓN","ECHARATE","08","09","02"]
[null,"08 Cusco","09 La Convención","03 Huayopata","08","09","03","Cusco","La Convención","Huayopata","080903","CUSCO","LA CONVENCIÓN","HUAYOPATA","08","09","03"]
[null,"08 Cusco","09 La Convención","04 Maranura","08","09","04","Cusco","La Convención","Maranura","080904","CUSCO","LA CONVENCIÓN","MARANURA","08","09","04"]
[null,"08 Cusco","09 La Convención","05 Ocobamba","08","09","05","Cusco","La Convención","Ocobamba","080905","CUSCO","LA CONVENCIÓN","OCOBAMBA","08","09","05"]
[null,"08 Cusco","09 La Convención","06 Quellouno","08","09","06","Cusco","La Convención","Quellouno","080906","CUSCO","LA CONVENCIÓN","QUELLOUNO","08","09","06"]
[null,"08 Cusco","09 La Convención","07 Kimbiri","08","09","07","Cusco","La Convención","Kimbiri","080907","CUSCO","LA CONVENCIÓN","KIMBIRI","08","09","07"]
[null,"08 Cusco","09 La Convención","08 Santa Teresa","08","09","08","Cusco","La Convención","Santa Teresa","080908","CUSCO","LA CONVENCIÓN","SANTA TERESA","08","09","08"]
[null,"08 Cusco","09 La Convención","09 Vilcabamba","08","09","09","Cusco","La Convención","Vilcabamba","080909","CUSCO","LA CONVENCIÓN","VILCABAMBA","08","09","09"]
[null,"08 Cusco","09 La Convención","10 Pichari","08","09","10","Cusco","La Convención","Pichari","080910","CUSCO","LA CONVENCIÓN","PICHARI","08","09","10"]
[null,"08 Cusco","09 La Convención","11 Inkawasi","08","09","11","Cusco","La Convención","Inkawasi","080911","CUSCO","LA CONVENCIÓN","INKAWASI","08","09","11"]
[null,"08 Cusco","09 La Convención","12 Villa Virgen","08","09","12","Cusco","La Convención","Villa Virgen","080912","CUSCO","LA CONVENCIÓN","VILLA VIRGEN","08","09","12"]
[null,"08 Cusco","09 La Convención","13 Villa Kintiarina","08","09","13","Cusco","La Convención","Villa Kintiarina","080913","CUSCO","LA CONVENCIÓN","VILLA KINTIARINA","08","09","13"]
[null,"08 Cusco","09 La Convención","14 Megantoni","08","09","14","Cusco","La Convención","Megantoni","080914","CUSCO","LA CONVENCIÓN","MEGANTONI","08","09","14"]
[null,"08 Cusco","10 Paruro","01 Paruro","08","10","01","Cusco","Paruro","Paruro","081001","CUSCO","PARURO","PARURO","08","10","01"]
[null,"08 Cusco","10 Paruro","02 Accha",{"$f":"+MID(B772,1,2)","v":"08"},"10","02","Cusco","Paruro","Accha",{"$f":"+CONCATENATE(E772,F772,G772)","v":"081002"},"CUSCO","PARURO","ACCHA","08","10","02"]
[null,"08 Cusco","10 Paruro","03 Ccapi","08","10","03","Cusco","Paruro","Ccapi","081003","CUSCO","PARURO","CCAPI","08","10","03"]
[null,"08 Cusco","10 Paruro","04 Colcha","08","10","04","Cusco","Paruro","Colcha","081004","CUSCO","PARURO","COLCHA","08","10","04"]
[null,"08 Cusco","10 Paruro","05 Huanoquite","08","10","05","Cusco","Paruro","Huanoquite","081005","CUSCO","PARURO","HUANOQUITE","08","10","05"]
[null,"08 Cusco","10 Paruro","06 Omacha","08","10","06","Cusco","Paruro","Omacha","081006","CUSCO","PARURO","OMACHA","08","10","06"]
[null,"08 Cusco","10 Paruro","07 Paccaritambo","08","10","07","Cusco","Paruro","Paccaritambo","081007","CUSCO","PARURO","PACCARITAMBO","08","10","07"]
[null,"08 Cusco","10 Paruro","08 Pillpinto","08","10","08","Cusco","Paruro","Pillpinto","081008","CUSCO","PARURO","PILLPINTO","08","10","08"]
[null,"08 Cusco","10 Paruro","09 Yaurisque","08","10","09","Cusco","Paruro","Yaurisque","081009","CUSCO","PARURO","YAURISQUE","08","10","09"]
[null,"08 Cusco","11 Paucartambo","01 Paucartambo","08","11","01","Cusco","Paucartambo","Paucartambo","081101","CUSCO","PAUCARTAMBO","PAUCARTAMBO","08","11","01"]
[null,"08 Cusco","11 Paucartambo","02 Caicay","08","11","02","Cusco","Paucartambo","Caicay","081102","CUSCO","PAUCARTAMBO","CAICAY","08","11","02"]
[null,"08 Cusco","11 Paucartambo","03 Challabamba","08","11","03","Cusco","Paucartambo","Challabamba","081103","CUSCO","PAUCARTAMBO","CHALLABAMBA","08","11","03"]
[null,"08 Cusco","11 Paucartambo","04 Colquepata","08","11","04","Cusco","Paucartambo","Colquepata","081104","CUSCO","PAUCARTAMBO","COLQUEPATA","08","11","04"]
[null,"08 Cusco","11 Paucartambo","05 Huancarani","08","11","05","Cusco","Paucartambo","Huancarani","081105","CUSCO","PAUCARTAMBO","HUANCARANI","08","11","05"]
[null,"08 Cusco","11 Paucartambo","06 Kosñipata","08","11","06","Cusco","Paucartambo","Kosñipata","081106","CUSCO","PAUCARTAMBO","KOSÑIPATA","08","11","06"]
[null,"08 Cusco","12 Quispicanchi","01 Urcos","08","12","01","Cusco","Quispicanchi","Urcos","081201","CUSCO","QUISPICANCHI","URCOS","08","12","01"]
[null,"08 Cusco","12 Quispicanchi","02 Andahuaylillas","08","12","02","Cusco","Quispicanchi","Andahuaylillas","081202","CUSCO","QUISPICANCHI","ANDAHUAYLILLAS","08","12","02"]
[null,"08 Cusco","12 Quispicanchi","03 Camanti","08","12","03","Cusco","Quispicanchi","Camanti","081203","CUSCO","QUISPICANCHI","CAMANTI","08","12","03"]
[null,"08 Cusco","12 Quispicanchi","04 Ccarhuayo","08","12","04","Cusco","Quispicanchi","Ccarhuayo","081204","CUSCO","QUISPICANCHI","CCARHUAYO","08","12","04"]
[null,"08 Cusco","12 Quispicanchi","05 Ccatca","08","12","05","Cusco","Quispicanchi","Ccatca","081205","CUSCO","QUISPICANCHI","CCATCA","08","12","05"]
[null,"08 Cusco","12 Quispicanchi","06 Cusipata","08","12","06","Cusco","Quispicanchi","Cusipata","081206","CUSCO","QUISPICANCHI","CUSIPATA","08","12","06"]
[null,"08 Cusco","12 Quispicanchi","07 Huaro","08","12","07","Cusco","Quispicanchi","Huaro","081207","CUSCO","QUISPICANCHI","HUARO","08","12","07"]
[null,"08 Cusco","12 Quispicanchi","08 Lucre","08","12","08","Cusco","Quispicanchi","Lucre","081208","CUSCO","QUISPICANCHI","LUCRE","08","12","08"]
[null,"08 Cusco","12 Quispicanchi","09 Marcapata","08","12","09","Cusco","Quispicanchi","Marcapata","081209","CUSCO","QUISPICANCHI","MARCAPATA","08","12","09"]
[null,"08 Cusco","12 Quispicanchi","10 Ocongate","08","12","10","Cusco","Quispicanchi","Ocongate","081210","CUSCO","QUISPICANCHI","OCONGATE","08","12","10"]
[null,"08 Cusco","12 Quispicanchi","11 Oropesa","08","12","11","Cusco","Quispicanchi","Oropesa","081211","CUSCO","QUISPICANCHI","OROPESA","08","12","11"]
[null,"08 Cusco","12 Quispicanchi","12 Quiquijana","08","12","12","Cusco","Quispicanchi","Quiquijana","081212","CUSCO","QUISPICANCHI","QUIQUIJANA","08","12","12"]
[null,"08 Cusco","13 Urubamba","01 Urubamba","08","13","01","Cusco","Urubamba","Urubamba","081301","CUSCO","URUBAMBA","URUBAMBA","08","13","01"]
[null,"08 Cusco","13 Urubamba","02 Chinchero","08","13","02","Cusco","Urubamba","Chinchero","081302","CUSCO","URUBAMBA","CHINCHERO","08","13","02"]
[null,"08 Cusco","13 Urubamba","03 Huayllabamba","08","13","03","Cusco","Urubamba","Huayllabamba","081303","CUSCO","URUBAMBA","HUAYLLABAMBA","08","13","03"]
[null,"08 Cusco","13 Urubamba","04 Machupicchu","08","13","04","Cusco","Urubamba","Machupicchu","081304","CUSCO","URUBAMBA","MACHUPICCHU","08","13","04"]
[null,"08 Cusco","13 Urubamba","05 Maras","08","13","05","Cusco","Urubamba","Maras","081305","CUSCO","URUBAMBA","MARAS","08","13","05"]
[null,"08 Cusco","13 Urubamba","06 Ollantaytambo","08","13","06","Cusco","Urubamba","Ollantaytambo","081306","CUSCO","URUBAMBA","OLLANTAYTAMBO","08","13","06"]
[null,"08 Cusco","13 Urubamba","07 Yucay","08","13","07","Cusco","Urubamba","Yucay","081307","CUSCO","URUBAMBA","YUCAY","08","13","07"]
[null,"09 Huancavelica","01 Huancavelica","01 Huancavelica","09","01","01","Huancavelica","Huancavelica","Huancavelica","090101","HUANCAVELICA","HUANCAVELICA","HUANCAVELICA","09","01","01"]
[null,"09 Huancavelica","01 Huancavelica","02 Acobambilla","09","01","02","Huancavelica","Huancavelica","Acobambilla","090102","HUANCAVELICA","HUANCAVELICA","ACOBAMBILLA","09","01","02"]
[null,"09 Huancavelica","01 Huancavelica","03 Acoria","09","01","03","Huancavelica","Huancavelica","Acoria","090103","HUANCAVELICA","HUANCAVELICA","ACORIA","09","01","03"]
[null,"09 Huancavelica","01 Huancavelica","04 Conayca","09","01","04","Huancavelica","Huancavelica","Conayca","090104","HUANCAVELICA","HUANCAVELICA","CONAYCA","09","01","04"]
[null,"09 Huancavelica","01 Huancavelica","05 Cuenca","09","01","05","Huancavelica","Huancavelica","Cuenca","090105","HUANCAVELICA","HUANCAVELICA","CUENCA","09","01","05"]
[null,"09 Huancavelica","01 Huancavelica","06 Huachocolpa","09","01","06","Huancavelica","Huancavelica","Huachocolpa","090106","HUANCAVELICA","HUANCAVELICA","HUACHOCOLPA","09","01","06"]
[null,"09 Huancavelica","01 Huancavelica","07 Huayllahuara","09","01","07","Huancavelica","Huancavelica","Huayllahuara","090107","HUANCAVELICA","HUANCAVELICA","HUAYLLAHUARA","09","01","07"]
[null,"09 Huancavelica","01 Huancavelica","08 Izcuchaca","09","01","08","Huancavelica","Huancavelica","Izcuchaca","090108","HUANCAVELICA","HUANCAVELICA","IZCUCHACA","09","01","08"]
[null,"09 Huancavelica","01 Huancavelica","09 Laria","09","01","09","Huancavelica","Huancavelica","Laria","090109","HUANCAVELICA","HUANCAVELICA","LARIA","09","01","09"]
[null,"09 Huancavelica","01 Huancavelica","10 Manta","09","01","10","Huancavelica","Huancavelica","Manta","090110","HUANCAVELICA","HUANCAVELICA","MANTA","09","01","10"]
[null,"09 Huancavelica","01 Huancavelica","11 Mariscal Cáceres","09","01","11","Huancavelica","Huancavelica","Mariscal Cáceres","090111","HUANCAVELICA","HUANCAVELICA","MARISCAL CÁCERES","09","01","11"]
[null,"09 Huancavelica","01 Huancavelica","12 Moya","09","01","12","Huancavelica","Huancavelica","Moya","090112","HUANCAVELICA","HUANCAVELICA","MOYA","09","01","12"]
[null,"09 Huancavelica","01 Huancavelica","13 Nuevo Occoro","09","01","13","Huancavelica","Huancavelica","Nuevo Occoro","090113","HUANCAVELICA","HUANCAVELICA","NUEVO OCCORO","09","01","13"]
[null,"09 Huancavelica","01 Huancavelica","14 Palca","09","01","14","Huancavelica","Huancavelica","Palca","090114","HUANCAVELICA","HUANCAVELICA","PALCA","09","01","14"]
[null,"09 Huancavelica","01 Huancavelica","15 Pilchaca","09","01","15","Huancavelica","Huancavelica","Pilchaca","090115","HUANCAVELICA","HUANCAVELICA","PILCHACA","09","01","15"]
[null,"09 Huancavelica","01 Huancavelica","16 Vilca","09","01","16","Huancavelica","Huancavelica","Vilca","090116","HUANCAVELICA","HUANCAVELICA","VILCA","09","01","16"]
[null,"09 Huancavelica","01 Huancavelica","17 Yauli","09","01","17","Huancavelica","Huancavelica","Yauli","090117","HUANCAVELICA","HUANCAVELICA","YAULI","09","01","17"]
[null,"09 Huancavelica","01 Huancavelica","18 Ascensión","09","01","18","Huancavelica","Huancavelica","Ascensión","090118","HUANCAVELICA","HUANCAVELICA","ASCENSIÓN","09","01","18"]
[null,"09 Huancavelica","01 Huancavelica","19 Huando","09","01","19","Huancavelica","Huancavelica","Huando","090119","HUANCAVELICA","HUANCAVELICA","HUANDO","09","01","19"]
[null,"09 Huancavelica","02 Acobamba","01 Acobamba","09","02","01","Huancavelica","Acobamba","Acobamba","090201","HUANCAVELICA","ACOBAMBA","ACOBAMBA","09","02","01"]
[null,"09 Huancavelica","02 Acobamba","02 Andabamba","09","02","02","Huancavelica","Acobamba","Andabamba","090202","HUANCAVELICA","ACOBAMBA","ANDABAMBA","09","02","02"]
[null,"09 Huancavelica","02 Acobamba","03 Anta","09","02","03","Huancavelica","Acobamba","Anta","090203","HUANCAVELICA","ACOBAMBA","ANTA","09","02","03"]
[null,"09 Huancavelica","02 Acobamba","04 Caja","09","02","04","Huancavelica","Acobamba","Caja","090204","HUANCAVELICA","ACOBAMBA","CAJA","09","02","04"]
[null,"09 Huancavelica","02 Acobamba","05 Marcas","09","02","05","Huancavelica","Acobamba","Marcas","090205","HUANCAVELICA","ACOBAMBA","MARCAS","09","02","05"]
[null,"09 Huancavelica","02 Acobamba","06 Paucara","09","02","06","Huancavelica","Acobamba","Paucara","090206","HUANCAVELICA","ACOBAMBA","PAUCARA","09","02","06"]
[null,"09 Huancavelica","02 Acobamba","07 Pomacocha","09","02","07","Huancavelica","Acobamba","Pomacocha","090207","HUANCAVELICA","ACOBAMBA","POMACOCHA","09","02","07"]
[null,"09 Huancavelica","02 Acobamba","08 Rosario","09","02","08","Huancavelica","Acobamba","Rosario","090208","HUANCAVELICA","ACOBAMBA","ROSARIO","09","02","08"]
[null,"09 Huancavelica","03 Angaraes","01 Lircay","09","03","01","Huancavelica","Angaraes","Lircay","090301","HUANCAVELICA","ANGARAES","LIRCAY","09","03","01"]
[null,"09 Huancavelica","03 Angaraes","02 Anchonga","09","03","02","Huancavelica","Angaraes","Anchonga","090302","HUANCAVELICA","ANGARAES","ANCHONGA","09","03","02"]
[null,"09 Huancavelica","03 Angaraes","03 Callanmarca","09","03","03","Huancavelica","Angaraes","Callanmarca","090303","HUANCAVELICA","ANGARAES","CALLANMARCA","09","03","03"]
[null,"09 Huancavelica","03 Angaraes","04 Ccochaccasa","09","03","04","Huancavelica","Angaraes","Ccochaccasa","090304","HUANCAVELICA","ANGARAES","CCOCHACCASA","09","03","04"]
[null,"09 Huancavelica","03 Angaraes","05 Chincho",{"$f":"+MID(B836,1,2)","v":"09"},"03","05","Huancavelica","Angaraes","Chincho",{"$f":"+CONCATENATE(E836,F836,G836)","v":"090305"},"HUANCAVELICA","ANGARAES","CHINCHO","09","03","05"]
[null,"09 Huancavelica","03 Angaraes","06 Congalla","09","03","06","Huancavelica","Angaraes","Congalla","090306","HUANCAVELICA","ANGARAES","CONGALLA","09","03","06"]
[null,"09 Huancavelica","03 Angaraes","07 Huanca-Huanca","09","03","07","Huancavelica","Angaraes","Huanca-Huanca","090307","HUANCAVELICA","ANGARAES","HUANCA-HUANCA","09","03","07"]
[null,"09 Huancavelica","03 Angaraes","08 Huayllay Grande","09","03","08","Huancavelica","Angaraes","Huayllay Grande","090308","HUANCAVELICA","ANGARAES","HUAYLLAY GRANDE","09","03","08"]
[null,"09 Huancavelica","03 Angaraes","09 Julcamarca","09","03","09","Huancavelica","Angaraes","Julcamarca","090309","HUANCAVELICA","ANGARAES","JULCAMARCA","09","03","09"]
[null,"09 Huancavelica","03 Angaraes","10 San Antonio de Antaparco","09","03","10","Huancavelica","Angaraes","San Antonio de Antaparco","090310","HUANCAVELICA","ANGARAES","SAN ANTONIO DE ANTAPARCO","09","03","10"]
[null,"09 Huancavelica","03 Angaraes","11 Santo Tomas de Pata","09","03","11","Huancavelica","Angaraes","Santo Tomas de Pata","090311","HUANCAVELICA","ANGARAES","SANTO TOMAS DE PATA","09","03","11"]
[null,"09 Huancavelica","03 Angaraes","12 Secclla","09","03","12","Huancavelica","Angaraes","Secclla","090312","HUANCAVELICA","ANGARAES","SECCLLA","09","03","12"]
[null,"09 Huancavelica","04 Castrovirreyna","01 Castrovirreyna","09","04","01","Huancavelica","Castrovirreyna","Castrovirreyna","090401","HUANCAVELICA","CASTROVIRREYNA","CASTROVIRREYNA","09","04","01"]
[null,"09 Huancavelica","04 Castrovirreyna","02 Arma","09","04","02","Huancavelica","Castrovirreyna","Arma","090402","HUANCAVELICA","CASTROVIRREYNA","ARMA","09","04","02"]
[null,"09 Huancavelica","04 Castrovirreyna","03 Aurahua","09","04","03","Huancavelica","Castrovirreyna","Aurahua","090403","HUANCAVELICA","CASTROVIRREYNA","AURAHUA","09","04","03"]
[null,"09 Huancavelica","04 Castrovirreyna","04 Capillas","09","04","04","Huancavelica","Castrovirreyna","Capillas","090404","HUANCAVELICA","CASTROVIRREYNA","CAPILLAS","09","04","04"]
[null,"09 Huancavelica","04 Castrovirreyna","05 Chupamarca","09","04","05","Huancavelica","Castrovirreyna","Chupamarca","090405","HUANCAVELICA","CASTROVIRREYNA","CHUPAMARCA","09","04","05"]
[null,"09 Huancavelica","04 Castrovirreyna","06 Cocas","09","04","06","Huancavelica","Castrovirreyna","Cocas","090406","HUANCAVELICA","CASTROVIRREYNA","COCAS","09","04","06"]
[null,"09 Huancavelica","04 Castrovirreyna","07 Huachos","09","04","07","Huancavelica","Castrovirreyna","Huachos","090407","HUANCAVELICA","CASTROVIRREYNA","HUACHOS","09","04","07"]
[null,"09 Huancavelica","04 Castrovirreyna","08 Huamatambo","09","04","08","Huancavelica","Castrovirreyna","Huamatambo","090408","HUANCAVELICA","CASTROVIRREYNA","HUAMATAMBO","09","04","08"]
[null,"09 Huancavelica","04 Castrovirreyna","09 Mollepampa","09","04","09","Huancavelica","Castrovirreyna","Mollepampa","090409","HUANCAVELICA","CASTROVIRREYNA","MOLLEPAMPA","09","04","09"]
[null,"09 Huancavelica","04 Castrovirreyna","10 San Juan","09","04","10","Huancavelica","Castrovirreyna","San Juan","090410","HUANCAVELICA","CASTROVIRREYNA","SAN JUAN","09","04","10"]
[null,"09 Huancavelica","04 Castrovirreyna","11 Santa Ana","09","04","11","Huancavelica","Castrovirreyna","Santa Ana","090411","HUANCAVELICA","CASTROVIRREYNA","SANTA ANA","09","04","11"]
[null,"09 Huancavelica","04 Castrovirreyna","12 Tantara","09","04","12","Huancavelica","Castrovirreyna","Tantara","090412","HUANCAVELICA","CASTROVIRREYNA","TANTARA","09","04","12"]
[null,"09 Huancavelica","04 Castrovirreyna","13 Ticrapo","09","04","13","Huancavelica","Castrovirreyna","Ticrapo","090413","HUANCAVELICA","CASTROVIRREYNA","TICRAPO","09","04","13"]
[null,"09 Huancavelica","05 Churcampa","01 Churcampa","09","05","01","Huancavelica","Churcampa","Churcampa","090501","HUANCAVELICA","CHURCAMPA","CHURCAMPA","09","05","01"]
[null,"09 Huancavelica","05 Churcampa","02 Anco","09","05","02","Huancavelica","Churcampa","Anco","090502","HUANCAVELICA","CHURCAMPA","ANCO","09","05","02"]
[null,"09 Huancavelica","05 Churcampa","03 Chinchihuasi","09","05","03","Huancavelica","Churcampa","Chinchihuasi","090503","HUANCAVELICA","CHURCAMPA","CHINCHIHUASI","09","05","03"]
[null,"09 Huancavelica","05 Churcampa","04 El Carmen","09","05","04","Huancavelica","Churcampa","El Carmen","090504","HUANCAVELICA","CHURCAMPA","EL CARMEN","09","05","04"]
[null,"09 Huancavelica","05 Churcampa","05 La Merced","09","05","05","Huancavelica","Churcampa","La Merced","090505","HUANCAVELICA","CHURCAMPA","LA MERCED","09","05","05"]
[null,"09 Huancavelica","05 Churcampa","06 Locroja","09","05","06","Huancavelica","Churcampa","Locroja","090506","HUANCAVELICA","CHURCAMPA","LOCROJA","09","05","06"]
[null,"09 Huancavelica","05 Churcampa","07 Paucarbamba","09","05","07","Huancavelica","Churcampa","Paucarbamba","090507","HUANCAVELICA","CHURCAMPA","PAUCARBAMBA","09","05","07"]
[null,"09 Huancavelica","05 Churcampa","08 San Miguel de Mayocc","09","05","08","Huancavelica","Churcampa","San Miguel de Mayocc","090508","HUANCAVELICA","CHURCAMPA","SAN MIGUEL DE MAYOCC","09","05","08"]
[null,"09 Huancavelica","05 Churcampa","09 San Pedro de Coris","09","05","09","Huancavelica","Churcampa","San Pedro de Coris","090509","HUANCAVELICA","CHURCAMPA","SAN PEDRO DE CORIS","09","05","09"]
[null,"09 Huancavelica","05 Churcampa","10 Pachamarca","09","05","10","Huancavelica","Churcampa","Pachamarca","090510","HUANCAVELICA","CHURCAMPA","PACHAMARCA","09","05","10"]
[null,"09 Huancavelica","05 Churcampa","11 Cosme","09","05","11","Huancavelica","Churcampa","Cosme","090511","HUANCAVELICA","CHURCAMPA","COSME","09","05","11"]
[null,"09 Huancavelica","06 Huaytará","01 Huaytara","09","06","01","Huancavelica","Huaytará","Huaytara","090601","HUANCAVELICA","HUAYTARÁ","HUAYTARA","09","06","01"]
[null,"09 Huancavelica","06 Huaytará","02 Ayavi","09","06","02","Huancavelica","Huaytará","Ayavi","090602","HUANCAVELICA","HUAYTARÁ","AYAVI","09","06","02"]
[null,"09 Huancavelica","06 Huaytará","03 Córdova","09","06","03","Huancavelica","Huaytará","Córdova","090603","HUANCAVELICA","HUAYTARÁ","CÓRDOVA","09","06","03"]
[null,"09 Huancavelica","06 Huaytará","04 Huayacundo Arma","09","06","04","Huancavelica","Huaytará","Huayacundo Arma","090604","HUANCAVELICA","HUAYTARÁ","HUAYACUNDO ARMA","09","06","04"]
[null,"09 Huancavelica","06 Huaytará","05 Laramarca","09","06","05","Huancavelica","Huaytará","Laramarca","090605","HUANCAVELICA","HUAYTARÁ","LARAMARCA","09","06","05"]
[null,"09 Huancavelica","06 Huaytará","06 Ocoyo","09","06","06","Huancavelica","Huaytará","Ocoyo","090606","HUANCAVELICA","HUAYTARÁ","OCOYO","09","06","06"]
[null,"09 Huancavelica","06 Huaytará","07 Pilpichaca","09","06","07","Huancavelica","Huaytará","Pilpichaca","090607","HUANCAVELICA","HUAYTARÁ","PILPICHACA","09","06","07"]
[null,"09 Huancavelica","06 Huaytará","08 Querco","09","06","08","Huancavelica","Huaytará","Querco","090608","HUANCAVELICA","HUAYTARÁ","QUERCO","09","06","08"]
[null,"09 Huancavelica","06 Huaytará","09 Quito-Arma","09","06","09","Huancavelica","Huaytará","Quito-Arma","090609","HUANCAVELICA","HUAYTARÁ","QUITO-ARMA","09","06","09"]
[null,"09 Huancavelica","06 Huaytará","10 San Antonio de Cusicancha","09","06","10","Huancavelica","Huaytará","San Antonio de Cusicancha","090610","HUANCAVELICA","HUAYTARÁ","SAN ANTONIO DE CUSICANCHA","09","06","10"]
[null,"09 Huancavelica","06 Huaytará","11 San Francisco de Sangayaico","09","06","11","Huancavelica","Huaytará","San Francisco de Sangayaico","090611","HUANCAVELICA","HUAYTARÁ","SAN FRANCISCO DE SANGAYAICO","09","06","11"]
[null,"09 Huancavelica","06 Huaytará","12 San Isidro","09","06","12","Huancavelica","Huaytará","San Isidro","090612","HUANCAVELICA","HUAYTARÁ","SAN ISIDRO","09","06","12"]
[null,"09 Huancavelica","06 Huaytará","13 Santiago de Chocorvos","09","06","13","Huancavelica","Huaytará","Santiago de Chocorvos","090613","HUANCAVELICA","HUAYTARÁ","SANTIAGO DE CHOCORVOS","09","06","13"]
[null,"09 Huancavelica","06 Huaytará","14 Santiago de Quirahuara","09","06","14","Huancavelica","Huaytará","Santiago de Quirahuara","090614","HUANCAVELICA","HUAYTARÁ","SANTIAGO DE QUIRAHUARA","09","06","14"]
[null,"09 Huancavelica","06 Huaytará","15 Santo Domingo de Capillas","09","06","15","Huancavelica","Huaytará","Santo Domingo de Capillas","090615","HUANCAVELICA","HUAYTARÁ","SANTO DOMINGO DE CAPILLAS","09","06","15"]
[null,"09 Huancavelica","06 Huaytará","16 Tambo","09","06","16","Huancavelica","Huaytará","Tambo","090616","HUANCAVELICA","HUAYTARÁ","TAMBO","09","06","16"]
[null,"09 Huancavelica","07 Tayacaja","01 Pampas","09","07","01","Huancavelica","Tayacaja","Pampas","090701","HUANCAVELICA","TAYACAJA","PAMPAS","09","07","01"]
[null,"09 Huancavelica","07 Tayacaja","02 Acostambo","09","07","02","Huancavelica","Tayacaja","Acostambo","090702","HUANCAVELICA","TAYACAJA","ACOSTAMBO","09","07","02"]
[null,"09 Huancavelica","07 Tayacaja","03 Acraquia","09","07","03","Huancavelica","Tayacaja","Acraquia","090703","HUANCAVELICA","TAYACAJA","ACRAQUIA","09","07","03"]
[null,"09 Huancavelica","07 Tayacaja","04 Ahuaycha","09","07","04","Huancavelica","Tayacaja","Ahuaycha","090704","HUANCAVELICA","TAYACAJA","AHUAYCHA","09","07","04"]
[null,"09 Huancavelica","07 Tayacaja","05 Colcabamba","09","07","05","Huancavelica","Tayacaja","Colcabamba","090705","HUANCAVELICA","TAYACAJA","COLCABAMBA","09","07","05"]
[null,"09 Huancavelica","07 Tayacaja","06 Daniel Hernández","09","07","06","Huancavelica","Tayacaja","Daniel Hernández","090706","HUANCAVELICA","TAYACAJA","DANIEL HERNÁNDEZ","09","07","06"]
[null,"09 Huancavelica","07 Tayacaja","07 Huachocolpa","09","07","07","Huancavelica","Tayacaja","Huachocolpa","090707","HUANCAVELICA","TAYACAJA","HUACHOCOLPA","09","07","07"]
[null,"09 Huancavelica","07 Tayacaja","09 Huaribamba","09","07","09","Huancavelica","Tayacaja","Huaribamba","090709","HUANCAVELICA","TAYACAJA","HUARIBAMBA","09","07","09"]
[null,"09 Huancavelica","07 Tayacaja","10 Ñahuimpuquio","09","07","10","Huancavelica","Tayacaja","Ñahuimpuquio","090710","HUANCAVELICA","TAYACAJA","ÑAHUIMPUQUIO","09","07","10"]
[null,"09 Huancavelica","07 Tayacaja","11 Pazos","09","07","11","Huancavelica","Tayacaja","Pazos","090711","HUANCAVELICA","TAYACAJA","PAZOS","09","07","11"]
[null,"09 Huancavelica","07 Tayacaja","13 Quishuar","09","07","13","Huancavelica","Tayacaja","Quishuar","090713","HUANCAVELICA","TAYACAJA","QUISHUAR","09","07","13"]
[null,"09 Huancavelica","07 Tayacaja","14 Salcabamba","09","07","14","Huancavelica","Tayacaja","Salcabamba","090714","HUANCAVELICA","TAYACAJA","SALCABAMBA","09","07","14"]
[null,"09 Huancavelica","07 Tayacaja","15 Salcahuasi","09","07","15","Huancavelica","Tayacaja","Salcahuasi","090715","HUANCAVELICA","TAYACAJA","SALCAHUASI","09","07","15"]
[null,"09 Huancavelica","07 Tayacaja","16 San Marcos de Rocchac","09","07","16","Huancavelica","Tayacaja","San Marcos de Rocchac","090716","HUANCAVELICA","TAYACAJA","SAN MARCOS DE ROCCHAC","09","07","16"]
[null,"09 Huancavelica","07 Tayacaja","17 Surcubamba","09","07","17","Huancavelica","Tayacaja","Surcubamba","090717","HUANCAVELICA","TAYACAJA","SURCUBAMBA","09","07","17"]
[null,"09 Huancavelica","07 Tayacaja","18 Tintay Puncu","09","07","18","Huancavelica","Tayacaja","Tintay Puncu","090718","HUANCAVELICA","TAYACAJA","TINTAY PUNCU","09","07","18"]
[null,"09 Huancavelica","07 Tayacaja","19 Quichuas",{"$f":"+MID(B900,1,2)","v":"09"},"07","19","Huancavelica","Tayacaja","Quichuas",{"$f":"+CONCATENATE(E900,F900,G900)","v":"090719"},"HUANCAVELICA","TAYACAJA","QUICHUAS","09","07","19"]
[null,"09 Huancavelica","07 Tayacaja","20 Andaymarca","09","07","20","Huancavelica","Tayacaja","Andaymarca","090720","HUANCAVELICA","TAYACAJA","ANDAYMARCA","09","07","20"]
[null,"09 Huancavelica","07 Tayacaja","21 Roble","09","07","21","Huancavelica","Tayacaja","Roble","090721","HUANCAVELICA","TAYACAJA","ROBLE","09","07","21"]
[null,"09 Huancavelica","07 Tayacaja","22 Pichos","09","07","22","Huancavelica","Tayacaja","Pichos","090722","HUANCAVELICA","TAYACAJA","PICHOS","09","07","22"]
[null,"09 Huancavelica","07 Tayacaja","23 Santiago de Tucuma","09","07","23","Huancavelica","Tayacaja","Santiago de Tucuma","090723","HUANCAVELICA","TAYACAJA","SANTIAGO DE TUCUMA","09","07","23"]
[null,"10 Huánuco","01 Huánuco","01 Huanuco","10","01","01","Huánuco","Huánuco","Huanuco","100101","HUÁNUCO","HUÁNUCO","HUANUCO","10","01","01"]
[null,"10 Huánuco","01 Huánuco","02 Amarilis","10","01","02","Huánuco","Huánuco","Amarilis","100102","HUÁNUCO","HUÁNUCO","AMARILIS","10","01","02"]
[null,"10 Huánuco","01 Huánuco","03 Chinchao","10","01","03","Huánuco","Huánuco","Chinchao","100103","HUÁNUCO","HUÁNUCO","CHINCHAO","10","01","03"]
[null,"10 Huánuco","01 Huánuco","04 Churubamba","10","01","04","Huánuco","Huánuco","Churubamba","100104","HUÁNUCO","HUÁNUCO","CHURUBAMBA","10","01","04"]
[null,"10 Huánuco","01 Huánuco","05 Margos","10","01","05","Huánuco","Huánuco","Margos","100105","HUÁNUCO","HUÁNUCO","MARGOS","10","01","05"]
[null,"10 Huánuco","01 Huánuco","06 Quisqui (Kichki)","10","01","06","Huánuco","Huánuco","Quisqui (Kichki)","100106","HUÁNUCO","HUÁNUCO","QUISQUI (KICHKI)","10","01","06"]
[null,"10 Huánuco","01 Huánuco","07 San Francisco de Cayran","10","01","07","Huánuco","Huánuco","San Francisco de Cayran","100107","HUÁNUCO","HUÁNUCO","SAN FRANCISCO DE CAYRAN","10","01","07"]
[null,"10 Huánuco","01 Huánuco","08 San Pedro de Chaulan","10","01","08","Huánuco","Huánuco","San Pedro de Chaulan","100108","HUÁNUCO","HUÁNUCO","SAN PEDRO DE CHAULAN","10","01","08"]
[null,"10 Huánuco","01 Huánuco","09 Santa María del Valle","10","01","09","Huánuco","Huánuco","Santa María del Valle","100109","HUÁNUCO","HUÁNUCO","SANTA MARÍA DEL VALLE","10","01","09"]
[null,"10 Huánuco","01 Huánuco","10 Yarumayo","10","01","10","Huánuco","Huánuco","Yarumayo","100110","HUÁNUCO","HUÁNUCO","YARUMAYO","10","01","10"]
[null,"10 Huánuco","01 Huánuco","11 Pillco Marca","10","01","11","Huánuco","Huánuco","Pillco Marca","100111","HUÁNUCO","HUÁNUCO","PILLCO MARCA","10","01","11"]
[null,"10 Huánuco","01 Huánuco","12 Yacus","10","01","12","Huánuco","Huánuco","Yacus","100112","HUÁNUCO","HUÁNUCO","YACUS","10","01","12"]
[null,"10 Huánuco","01 Huánuco","13 San Pablo de Pillao","10","01","13","Huánuco","Huánuco","San Pablo de Pillao","100113","HUÁNUCO","HUÁNUCO","SAN PABLO DE PILLAO","10","01","13"]
[null,"10 Huánuco","02 Ambo","01 Ambo","10","02","01","Huánuco","Ambo","Ambo","100201","HUÁNUCO","AMBO","AMBO","10","02","01"]
[null,"10 Huánuco","02 Ambo","02 Cayna","10","02","02","Huánuco","Ambo","Cayna","100202","HUÁNUCO","AMBO","CAYNA","10","02","02"]
[null,"10 Huánuco","02 Ambo","03 Colpas","10","02","03","Huánuco","Ambo","Colpas","100203","HUÁNUCO","AMBO","COLPAS","10","02","03"]
[null,"10 Huánuco","02 Ambo","04 Conchamarca","10","02","04","Huánuco","Ambo","Conchamarca","100204","HUÁNUCO","AMBO","CONCHAMARCA","10","02","04"]
[null,"10 Huánuco","02 Ambo","05 Huacar","10","02","05","Huánuco","Ambo","Huacar","100205","HUÁNUCO","AMBO","HUACAR","10","02","05"]
[null,"10 Huánuco","02 Ambo","06 San Francisco","10","02","06","Huánuco","Ambo","San Francisco","100206","HUÁNUCO","AMBO","SAN FRANCISCO","10","02","06"]
[null,"10 Huánuco","02 Ambo","07 San Rafael","10","02","07","Huánuco","Ambo","San Rafael","100207","HUÁNUCO","AMBO","SAN RAFAEL","10","02","07"]
[null,"10 Huánuco","02 Ambo","08 Tomay Kichwa","10","02","08","Huánuco","Ambo","Tomay Kichwa","100208","HUÁNUCO","AMBO","TOMAY KICHWA","10","02","08"]
[null,"10 Huánuco","03 Dos de Mayo","01 La Unión","10","03","01","Huánuco","Dos de Mayo","La Unión","100301","HUÁNUCO","DOS DE MAYO","LA UNIÓN","10","03","01"]
[null,"10 Huánuco","03 Dos de Mayo","07 Chuquis","10","03","07","Huánuco","Dos de Mayo","Chuquis","100307","HUÁNUCO","DOS DE MAYO","CHUQUIS","10","03","07"]
[null,"10 Huánuco","03 Dos de Mayo","11 Marías","10","03","11","Huánuco","Dos de Mayo","Marías","100311","HUÁNUCO","DOS DE MAYO","MARÍAS","10","03","11"]
[null,"10 Huánuco","03 Dos de Mayo","13 Pachas","10","03","13","Huánuco","Dos de Mayo","Pachas","100313","HUÁNUCO","DOS DE MAYO","PACHAS","10","03","13"]
[null,"10 Huánuco","03 Dos de Mayo","16 Quivilla","10","03","16","Huánuco","Dos de Mayo","Quivilla","100316","HUÁNUCO","DOS DE MAYO","QUIVILLA","10","03","16"]
[null,"10 Huánuco","03 Dos de Mayo","17 Ripan","10","03","17","Huánuco","Dos de Mayo","Ripan","100317","HUÁNUCO","DOS DE MAYO","RIPAN","10","03","17"]
[null,"10 Huánuco","03 Dos de Mayo","21 Shunqui","10","03","21","Huánuco","Dos de Mayo","Shunqui","100321","HUÁNUCO","DOS DE MAYO","SHUNQUI","10","03","21"]
[null,"10 Huánuco","03 Dos de Mayo","22 Sillapata","10","03","22","Huánuco","Dos de Mayo","Sillapata","100322","HUÁNUCO","DOS DE MAYO","SILLAPATA","10","03","22"]
[null,"10 Huánuco","03 Dos de Mayo","23 Yanas","10","03","23","Huánuco","Dos de Mayo","Yanas","100323","HUÁNUCO","DOS DE MAYO","YANAS","10","03","23"]
[null,"10 Huánuco","04 Huacaybamba","01 Huacaybamba","10","04","01","Huánuco","Huacaybamba","Huacaybamba","100401","HUÁNUCO","HUACAYBAMBA","HUACAYBAMBA","10","04","01"]
[null,"10 Huánuco","04 Huacaybamba","02 Canchabamba","10","04","02","Huánuco","Huacaybamba","Canchabamba","100402","HUÁNUCO","HUACAYBAMBA","CANCHABAMBA","10","04","02"]
[null,"10 Huánuco","04 Huacaybamba","03 Cochabamba","10","04","03","Huánuco","Huacaybamba","Cochabamba","100403","HUÁNUCO","HUACAYBAMBA","COCHABAMBA","10","04","03"]
[null,"10 Huánuco","04 Huacaybamba","04 Pinra","10","04","04","Huánuco","Huacaybamba","Pinra","100404","HUÁNUCO","HUACAYBAMBA","PINRA","10","04","04"]
[null,"10 Huánuco","05 Huamalíes","01 Llata","10","05","01","Huánuco","Huamalíes","Llata","100501","HUÁNUCO","HUAMALÍES","LLATA","10","05","01"]
[null,"10 Huánuco","05 Huamalíes","02 Arancay","10","05","02","Huánuco","Huamalíes","Arancay","100502","HUÁNUCO","HUAMALÍES","ARANCAY","10","05","02"]
[null,"10 Huánuco","05 Huamalíes","03 Chavín de Pariarca","10","05","03","Huánuco","Huamalíes","Chavín de Pariarca","100503","HUÁNUCO","HUAMALÍES","CHAVÍN DE PARIARCA","10","05","03"]
[null,"10 Huánuco","05 Huamalíes","04 Jacas Grande","10","05","04","Huánuco","Huamalíes","Jacas Grande","100504","HUÁNUCO","HUAMALÍES","JACAS GRANDE","10","05","04"]
[null,"10 Huánuco","05 Huamalíes","05 Jircan","10","05","05","Huánuco","Huamalíes","Jircan","100505","HUÁNUCO","HUAMALÍES","JIRCAN","10","05","05"]
[null,"10 Huánuco","05 Huamalíes","06 Miraflores","10","05","06","Huánuco","Huamalíes","Miraflores","100506","HUÁNUCO","HUAMALÍES","MIRAFLORES","10","05","06"]
[null,"10 Huánuco","05 Huamalíes","07 Monzón","10","05","07","Huánuco","Huamalíes","Monzón","100507","HUÁNUCO","HUAMALÍES","MONZÓN","10","05","07"]
[null,"10 Huánuco","05 Huamalíes","08 Punchao","10","05","08","Huánuco","Huamalíes","Punchao","100508","HUÁNUCO","HUAMALÍES","PUNCHAO","10","05","08"]
[null,"10 Huánuco","05 Huamalíes","09 Puños","10","05","09","Huánuco","Huamalíes","Puños","100509","HUÁNUCO","HUAMALÍES","PUÑOS","10","05","09"]
[null,"10 Huánuco","05 Huamalíes","10 Singa","10","05","10","Huánuco","Huamalíes","Singa","100510","HUÁNUCO","HUAMALÍES","SINGA","10","05","10"]
[null,"10 Huánuco","05 Huamalíes","11 Tantamayo","10","05","11","Huánuco","Huamalíes","Tantamayo","100511","HUÁNUCO","HUAMALÍES","TANTAMAYO","10","05","11"]
[null,"10 Huánuco","06 Leoncio Prado","01 Rupa-Rupa","10","06","01","Huánuco","Leoncio Prado","Rupa-Rupa","100601","HUÁNUCO","LEONCIO PRADO","RUPA-RUPA","10","06","01"]
[null,"10 Huánuco","06 Leoncio Prado","02 Daniel Alomía Robles","10","06","02","Huánuco","Leoncio Prado","Daniel Alomía Robles","100602","HUÁNUCO","LEONCIO PRADO","DANIEL ALOMÍA ROBLES","10","06","02"]
[null,"10 Huánuco","06 Leoncio Prado","03 Hermílio Valdizan","10","06","03","Huánuco","Leoncio Prado","Hermílio Valdizan","100603","HUÁNUCO","LEONCIO PRADO","HERMÍLIO VALDIZAN","10","06","03"]
[null,"10 Huánuco","06 Leoncio Prado","04 José Crespo y Castillo","10","06","04","Huánuco","Leoncio Prado","José Crespo y Castillo","100604","HUÁNUCO","LEONCIO PRADO","JOSÉ CRESPO Y CASTILLO","10","06","04"]
[null,"10 Huánuco","06 Leoncio Prado","05 Luyando","10","06","05","Huánuco","Leoncio Prado","Luyando","100605","HUÁNUCO","LEONCIO PRADO","LUYANDO","10","06","05"]
[null,"10 Huánuco","06 Leoncio Prado","06 Mariano Damaso Beraun","10","06","06","Huánuco","Leoncio Prado","Mariano Damaso Beraun","100606","HUÁNUCO","LEONCIO PRADO","MARIANO DAMASO BERAUN","10","06","06"]
[null,"10 Huánuco","06 Leoncio Prado","07 Pucayacu","10","06","07","Huánuco","Leoncio Prado","Pucayacu","100607","HUÁNUCO","LEONCIO PRADO","PUCAYACU","10","06","07"]
[null,"10 Huánuco","06 Leoncio Prado","08 Castillo Grande","10","06","08","Huánuco","Leoncio Prado","Castillo Grande","100608","HUÁNUCO","LEONCIO PRADO","CASTILLO GRANDE","10","06","08"]
[null,"10 Huánuco","06 Leoncio Prado","09 Pueblo Nuevo","10","06","09","Huánuco","Leoncio Prado","Pueblo Nuevo","100609","HUÁNUCO","LEONCIO PRADO","PUEBLO NUEVO","10","06","09"]
[null,"10 Huánuco","06 Leoncio Prado","10 Santo Domingo de Anda","10","06","10","Huánuco","Leoncio Prado","Santo Domingo de Anda","100610","HUÁNUCO","LEONCIO PRADO","SANTO DOMINGO DE ANDA","10","06","10"]
[null,"10 Huánuco","07 Marañón","01 Huacrachuco","10","07","01","Huánuco","Marañón","Huacrachuco","100701","HUÁNUCO","MARAÑÓN","HUACRACHUCO","10","07","01"]
[null,"10 Huánuco","07 Marañón","02 Cholon","10","07","02","Huánuco","Marañón","Cholon","100702","HUÁNUCO","MARAÑÓN","CHOLON","10","07","02"]
[null,"10 Huánuco","07 Marañón","03 San Buenaventura","10","07","03","Huánuco","Marañón","San Buenaventura","100703","HUÁNUCO","MARAÑÓN","SAN BUENAVENTURA","10","07","03"]
[null,"10 Huánuco","07 Marañón","04 La Morada","10","07","04","Huánuco","Marañón","La Morada","100704","HUÁNUCO","MARAÑÓN","LA MORADA","10","07","04"]
[null,"10 Huánuco","07 Marañón","05 Santa Rosa de Alto Yanajanca",{"$f":"+MID(B964,1,2)","v":"10"},"07","05","Huánuco","Marañón","Santa Rosa de Alto Yanajanca",{"$f":"+CONCATENATE(E964,F964,G964)","v":"100705"},"HUÁNUCO","MARAÑÓN","SANTA ROSA DE ALTO YANAJANCA","10","07","05"]
[null,"10 Huánuco","08 Pachitea","01 Panao","10","08","01","Huánuco","Pachitea","Panao","100801","HUÁNUCO","PACHITEA","PANAO","10","08","01"]
[null,"10 Huánuco","08 Pachitea","02 Chaglla","10","08","02","Huánuco","Pachitea","Chaglla","100802","HUÁNUCO","PACHITEA","CHAGLLA","10","08","02"]
[null,"10 Huánuco","08 Pachitea","03 Molino","10","08","03","Huánuco","Pachitea","Molino","100803","HUÁNUCO","PACHITEA","MOLINO","10","08","03"]
[null,"10 Huánuco","08 Pachitea","04 Umari","10","08","04","Huánuco","Pachitea","Umari","100804","HUÁNUCO","PACHITEA","UMARI","10","08","04"]
[null,"10 Huánuco","09 Puerto Inca","01 Puerto Inca","10","09","01","Huánuco","Puerto Inca","Puerto Inca","100901","HUÁNUCO","PUERTO INCA","PUERTO INCA","10","09","01"]
[null,"10 Huánuco","09 Puerto Inca","02 Codo del Pozuzo","10","09","02","Huánuco","Puerto Inca","Codo del Pozuzo","100902","HUÁNUCO","PUERTO INCA","CODO DEL POZUZO","10","09","02"]
[null,"10 Huánuco","09 Puerto Inca","03 Honoria","10","09","03","Huánuco","Puerto Inca","Honoria","100903","HUÁNUCO","PUERTO INCA","HONORIA","10","09","03"]
[null,"10 Huánuco","09 Puerto Inca","04 Tournavista","10","09","04","Huánuco","Puerto Inca","Tournavista","100904","HUÁNUCO","PUERTO INCA","TOURNAVISTA","10","09","04"]
[null,"10 Huánuco","09 Puerto Inca","05 Yuyapichis","10","09","05","Huánuco","Puerto Inca","Yuyapichis","100905","HUÁNUCO","PUERTO INCA","YUYAPICHIS","10","09","05"]
[null,"10 Huánuco","10 Lauricocha ","01 Jesús","10","10","01","Huánuco","Lauricocha ","Jesús","101001","HUÁNUCO","LAURICOCHA","JESÚS","10","10","01"]
[null,"10 Huánuco","10 Lauricocha ","02 Baños","10","10","02","Huánuco","Lauricocha ","Baños","101002","HUÁNUCO","LAURICOCHA","BAÑOS","10","10","02"]
[null,"10 Huánuco","10 Lauricocha ","03 Jivia","10","10","03","Huánuco","Lauricocha ","Jivia","101003","HUÁNUCO","LAURICOCHA","JIVIA","10","10","03"]
[null,"10 Huánuco","10 Lauricocha ","04 Queropalca","10","10","04","Huánuco","Lauricocha ","Queropalca","101004","HUÁNUCO","LAURICOCHA","QUEROPALCA","10","10","04"]
[null,"10 Huánuco","10 Lauricocha ","05 Rondos","10","10","05","Huánuco","Lauricocha ","Rondos","101005","HUÁNUCO","LAURICOCHA","RONDOS","10","10","05"]
[null,"10 Huánuco","10 Lauricocha ","06 San Francisco de Asís","10","10","06","Huánuco","Lauricocha ","San Francisco de Asís","101006","HUÁNUCO","LAURICOCHA","SAN FRANCISCO DE ASÍS","10","10","06"]
[null,"10 Huánuco","10 Lauricocha ","07 San Miguel de Cauri","10","10","07","Huánuco","Lauricocha ","San Miguel de Cauri","101007","HUÁNUCO","LAURICOCHA","SAN MIGUEL DE CAURI","10","10","07"]
[null,"10 Huánuco","11 Yarowilca ","01 Chavinillo","10","11","01","Huánuco","Yarowilca ","Chavinillo","101101","HUÁNUCO","YAROWILCA","CHAVINILLO","10","11","01"]
[null,"10 Huánuco","11 Yarowilca ","02 Cahuac","10","11","02","Huánuco","Yarowilca ","Cahuac","101102","HUÁNUCO","YAROWILCA","CAHUAC","10","11","02"]
[null,"10 Huánuco","11 Yarowilca ","03 Chacabamba","10","11","03","Huánuco","Yarowilca ","Chacabamba","101103","HUÁNUCO","YAROWILCA","CHACABAMBA","10","11","03"]
[null,"10 Huánuco","11 Yarowilca ","04 Aparicio Pomares","10","11","04","Huánuco","Yarowilca ","Aparicio Pomares","101104","HUÁNUCO","YAROWILCA","APARICIO POMARES","10","11","04"]
[null,"10 Huánuco","11 Yarowilca ","05 Jacas Chico","10","11","05","Huánuco","Yarowilca ","Jacas Chico","101105","HUÁNUCO","YAROWILCA","JACAS CHICO","10","11","05"]
[null,"10 Huánuco","11 Yarowilca ","06 Obas","10","11","06","Huánuco","Yarowilca ","Obas","101106","HUÁNUCO","YAROWILCA","OBAS","10","11","06"]
[null,"10 Huánuco","11 Yarowilca ","07 Pampamarca","10","11","07","Huánuco","Yarowilca ","Pampamarca","101107","HUÁNUCO","YAROWILCA","PAMPAMARCA","10","11","07"]
[null,"10 Huánuco","11 Yarowilca ","08 Choras","10","11","08","Huánuco","Yarowilca ","Choras","101108","HUÁNUCO","YAROWILCA","CHORAS","10","11","08"]
[null,"11 Ica","01 Ica ","01 Ica","11","01","01","Ica","Ica ","Ica","110101","ICA","ICA","ICA","11","01","01"]
[null,"11 Ica","01 Ica ","02 La Tinguiña","11","01","02","Ica","Ica ","La Tinguiña","110102","ICA","ICA","LA TINGUIÑA","11","01","02"]
[null,"11 Ica","01 Ica ","03 Los Aquijes","11","01","03","Ica","Ica ","Los Aquijes","110103","ICA","ICA","LOS AQUIJES","11","01","03"]
[null,"11 Ica","01 Ica ","04 Ocucaje","11","01","04","Ica","Ica ","Ocucaje","110104","ICA","ICA","OCUCAJE","11","01","04"]
[null,"11 Ica","01 Ica ","05 Pachacutec","11","01","05","Ica","Ica ","Pachacutec","110105","ICA","ICA","PACHACUTEC","11","01","05"]
[null,"11 Ica","01 Ica ","06 Parcona","11","01","06","Ica","Ica ","Parcona","110106","ICA","ICA","PARCONA","11","01","06"]
[null,"11 Ica","01 Ica ","07 Pueblo Nuevo","11","01","07","Ica","Ica ","Pueblo Nuevo","110107","ICA","ICA","PUEBLO NUEVO","11","01","07"]
[null,"11 Ica","01 Ica ","08 Salas","11","01","08","Ica","Ica ","Salas","110108","ICA","ICA","SALAS","11","01","08"]
[null,"11 Ica","01 Ica ","09 San José de Los Molinos","11","01","09","Ica","Ica ","San José de Los Molinos","110109","ICA","ICA","SAN JOSÉ DE LOS MOLINOS","11","01","09"]
[null,"11 Ica","01 Ica ","10 San Juan Bautista","11","01","10","Ica","Ica ","San Juan Bautista","110110","ICA","ICA","SAN JUAN BAUTISTA","11","01","10"]
[null,"11 Ica","01 Ica ","11 Santiago","11","01","11","Ica","Ica ","Santiago","110111","ICA","ICA","SANTIAGO","11","01","11"]
[null,"11 Ica","01 Ica ","12 Subtanjalla","11","01","12","Ica","Ica ","Subtanjalla","110112","ICA","ICA","SUBTANJALLA","11","01","12"]
[null,"11 Ica","01 Ica ","13 Tate","11","01","13","Ica","Ica ","Tate","110113","ICA","ICA","TATE","11","01","13"]
[null,"11 Ica","01 Ica ","14 Yauca del Rosario","11","01","14","Ica","Ica ","Yauca del Rosario","110114","ICA","ICA","YAUCA DEL ROSARIO","11","01","14"]
[null,"11 Ica","02 Chincha ","01 Chincha Alta","11","02","01","Ica","Chincha ","Chincha Alta","110201","ICA","CHINCHA","CHINCHA ALTA","11","02","01"]
[null,"11 Ica","02 Chincha ","02 Alto Laran","11","02","02","Ica","Chincha ","Alto Laran","110202","ICA","CHINCHA","ALTO LARAN","11","02","02"]
[null,"11 Ica","02 Chincha ","03 Chavin","11","02","03","Ica","Chincha ","Chavin","110203","ICA","CHINCHA","CHAVIN","11","02","03"]
[null,"11 Ica","02 Chincha ","04 Chincha Baja","11","02","04","Ica","Chincha ","Chincha Baja","110204","ICA","CHINCHA","CHINCHA BAJA","11","02","04"]
[null,"11 Ica","02 Chincha ","05 El Carmen","11","02","05","Ica","Chincha ","El Carmen","110205","ICA","CHINCHA","EL CARMEN","11","02","05"]
[null,"11 Ica","02 Chincha ","06 Grocio Prado","11","02","06","Ica","Chincha ","Grocio Prado","110206","ICA","CHINCHA","GROCIO PRADO","11","02","06"]
[null,"11 Ica","02 Chincha ","07 Pueblo Nuevo","11","02","07","Ica","Chincha ","Pueblo Nuevo","110207","ICA","CHINCHA","PUEBLO NUEVO","11","02","07"]
[null,"11 Ica","02 Chincha ","08 San Juan de Yanac","11","02","08","Ica","Chincha ","San Juan de Yanac","110208","ICA","CHINCHA","SAN JUAN DE YANAC","11","02","08"]
[null,"11 Ica","02 Chincha ","09 San Pedro de Huacarpana","11","02","09","Ica","Chincha ","San Pedro de Huacarpana","110209","ICA","CHINCHA","SAN PEDRO DE HUACARPANA","11","02","09"]
[null,"11 Ica","02 Chincha ","10 Sunampe","11","02","10","Ica","Chincha ","Sunampe","110210","ICA","CHINCHA","SUNAMPE","11","02","10"]
[null,"11 Ica","02 Chincha ","11 Tambo de Mora","11","02","11","Ica","Chincha ","Tambo de Mora","110211","ICA","CHINCHA","TAMBO DE MORA","11","02","11"]
[null,"11 Ica","03 Nasca ","01 Nasca","11","03","01","Ica","Nasca ","Nasca","110301","ICA","NASCA","NASCA","11","03","01"]
[null,"11 Ica","03 Nasca ","02 Changuillo","11","03","02","Ica","Nasca ","Changuillo","110302","ICA","NASCA","CHANGUILLO","11","03","02"]
[null,"11 Ica","03 Nasca ","03 El Ingenio","11","03","03","Ica","Nasca ","El Ingenio","110303","ICA","NASCA","EL INGENIO","11","03","03"]
[null,"11 Ica","03 Nasca ","04 Marcona","11","03","04","Ica","Nasca ","Marcona","110304","ICA","NASCA","MARCONA","11","03","04"]
[null,"11 Ica","03 Nasca ","05 Vista Alegre","11","03","05","Ica","Nasca ","Vista Alegre","110305","ICA","NASCA","VISTA ALEGRE","11","03","05"]
[null,"11 Ica","04 Palpa ","01 Palpa","11","04","01","Ica","Palpa ","Palpa","110401","ICA","PALPA","PALPA","11","04","01"]
[null,"11 Ica","04 Palpa ","02 Llipata","11","04","02","Ica","Palpa ","Llipata","110402","ICA","PALPA","LLIPATA","11","04","02"]
[null,"11 Ica","04 Palpa ","03 Río Grande","11","04","03","Ica","Palpa ","Río Grande","110403","ICA","PALPA","RÍO GRANDE","11","04","03"]
[null,"11 Ica","04 Palpa ","04 Santa Cruz","11","04","04","Ica","Palpa ","Santa Cruz","110404","ICA","PALPA","SANTA CRUZ","11","04","04"]
[null,"11 Ica","04 Palpa ","05 Tibillo","11","04","05","Ica","Palpa ","Tibillo","110405","ICA","PALPA","TIBILLO","11","04","05"]
[null,"11 Ica","05 Pisco ","01 Pisco","11","05","01","Ica","Pisco ","Pisco","110501","ICA","PISCO","PISCO","11","05","01"]
[null,"11 Ica","05 Pisco ","02 Huancano","11","05","02","Ica","Pisco ","Huancano","110502","ICA","PISCO","HUANCANO","11","05","02"]
[null,"11 Ica","05 Pisco ","03 Humay","11","05","03","Ica","Pisco ","Humay","110503","ICA","PISCO","HUMAY","11","05","03"]
[null,"11 Ica","05 Pisco ","04 Independencia","11","05","04","Ica","Pisco ","Independencia","110504","ICA","PISCO","INDEPENDENCIA","11","05","04"]
[null,"11 Ica","05 Pisco ","05 Paracas",{"$f":"+MID(B1028,1,2)","v":"11"},"05","05","Ica","Pisco ","Paracas",{"$f":"+CONCATENATE(E1028,F1028,G1028)","v":"110505"},"ICA","PISCO","PARACAS","11","05","05"]
[null,"11 Ica","05 Pisco ","06 San Andrés","11","05","06","Ica","Pisco ","San Andrés","110506","ICA","PISCO","SAN ANDRÉS","11","05","06"]
[null,"11 Ica","05 Pisco ","07 San Clemente","11","05","07","Ica","Pisco ","San Clemente","110507","ICA","PISCO","SAN CLEMENTE","11","05","07"]
[null,"11 Ica","05 Pisco ","08 Tupac Amaru Inca","11","05","08","Ica","Pisco ","Tupac Amaru Inca","110508","ICA","PISCO","TUPAC AMARU INCA","11","05","08"]
[null,"12 Junín","01 Huancayo ","01 Huancayo","12","01","01","Junín","Huancayo ","Huancayo","120101","JUNÍN","HUANCAYO","HUANCAYO","12","01","01"]
[null,"12 Junín","01 Huancayo ","04 Carhuacallanga","12","01","04","Junín","Huancayo ","Carhuacallanga","120104","JUNÍN","HUANCAYO","CARHUACALLANGA","12","01","04"]
[null,"12 Junín","01 Huancayo ","05 Chacapampa","12","01","05","Junín","Huancayo ","Chacapampa","120105","JUNÍN","HUANCAYO","CHACAPAMPA","12","01","05"]
[null,"12 Junín","01 Huancayo ","06 Chicche","12","01","06","Junín","Huancayo ","Chicche","120106","JUNÍN","HUANCAYO","CHICCHE","12","01","06"]
[null,"12 Junín","01 Huancayo ","07 Chilca","12","01","07","Junín","Huancayo ","Chilca","120107","JUNÍN","HUANCAYO","CHILCA","12","01","07"]
[null,"12 Junín","01 Huancayo ","08 Chongos Alto","12","01","08","Junín","Huancayo ","Chongos Alto","120108","JUNÍN","HUANCAYO","CHONGOS ALTO","12","01","08"]
[null,"12 Junín","01 Huancayo ","11 Chupuro","12","01","11","Junín","Huancayo ","Chupuro","120111","JUNÍN","HUANCAYO","CHUPURO","12","01","11"]
[null,"12 Junín","01 Huancayo ","12 Colca","12","01","12","Junín","Huancayo ","Colca","120112","JUNÍN","HUANCAYO","COLCA","12","01","12"]
[null,"12 Junín","01 Huancayo ","13 Cullhuas","12","01","13","Junín","Huancayo ","Cullhuas","120113","JUNÍN","HUANCAYO","CULLHUAS","12","01","13"]
[null,"12 Junín","01 Huancayo ","14 El Tambo","12","01","14","Junín","Huancayo ","El Tambo","120114","JUNÍN","HUANCAYO","EL TAMBO","12","01","14"]
[null,"12 Junín","01 Huancayo ","16 Huacrapuquio","12","01","16","Junín","Huancayo ","Huacrapuquio","120116","JUNÍN","HUANCAYO","HUACRAPUQUIO","12","01","16"]
[null,"12 Junín","01 Huancayo ","17 Hualhuas","12","01","17","Junín","Huancayo ","Hualhuas","120117","JUNÍN","HUANCAYO","HUALHUAS","12","01","17"]
[null,"12 Junín","01 Huancayo ","19 Huancan","12","01","19","Junín","Huancayo ","Huancan","120119","JUNÍN","HUANCAYO","HUANCAN","12","01","19"]
[null,"12 Junín","01 Huancayo ","20 Huasicancha","12","01","20","Junín","Huancayo ","Huasicancha","120120","JUNÍN","HUANCAYO","HUASICANCHA","12","01","20"]
[null,"12 Junín","01 Huancayo ","21 Huayucachi","12","01","21","Junín","Huancayo ","Huayucachi","120121","JUNÍN","HUANCAYO","HUAYUCACHI","12","01","21"]
[null,"12 Junín","01 Huancayo ","22 Ingenio","12","01","22","Junín","Huancayo ","Ingenio","120122","JUNÍN","HUANCAYO","INGENIO","12","01","22"]
[null,"12 Junín","01 Huancayo ","24 Pariahuanca","12","01","24","Junín","Huancayo ","Pariahuanca","120124","JUNÍN","HUANCAYO","PARIAHUANCA","12","01","24"]
[null,"12 Junín","01 Huancayo ","25 Pilcomayo","12","01","25","Junín","Huancayo ","Pilcomayo","120125","JUNÍN","HUANCAYO","PILCOMAYO","12","01","25"]
[null,"12 Junín","01 Huancayo ","26 Pucara","12","01","26","Junín","Huancayo ","Pucara","120126","JUNÍN","HUANCAYO","PUCARA","12","01","26"]
[null,"12 Junín","01 Huancayo ","27 Quichuay","12","01","27","Junín","Huancayo ","Quichuay","120127","JUNÍN","HUANCAYO","QUICHUAY","12","01","27"]
[null,"12 Junín","01 Huancayo ","28 Quilcas","12","01","28","Junín","Huancayo ","Quilcas","120128","JUNÍN","HUANCAYO","QUILCAS","12","01","28"]
[null,"12 Junín","01 Huancayo ","29 San Agustín","12","01","29","Junín","Huancayo ","San Agustín","120129","JUNÍN","HUANCAYO","SAN AGUSTÍN","12","01","29"]
[null,"12 Junín","01 Huancayo ","30 San Jerónimo de Tunan","12","01","30","Junín","Huancayo ","San Jerónimo de Tunan","120130","JUNÍN","HUANCAYO","SAN JERÓNIMO DE TUNAN","12","01","30"]
[null,"12 Junín","01 Huancayo ","32 Saño","12","01","32","Junín","Huancayo ","Saño","120132","JUNÍN","HUANCAYO","SAÑO","12","01","32"]
[null,"12 Junín","01 Huancayo ","33 Sapallanga","12","01","33","Junín","Huancayo ","Sapallanga","120133","JUNÍN","HUANCAYO","SAPALLANGA","12","01","33"]
[null,"12 Junín","01 Huancayo ","34 Sicaya","12","01","34","Junín","Huancayo ","Sicaya","120134","JUNÍN","HUANCAYO","SICAYA","12","01","34"]
[null,"12 Junín","01 Huancayo ","35 Santo Domingo de Acobamba","12","01","35","Junín","Huancayo ","Santo Domingo de Acobamba","120135","JUNÍN","HUANCAYO","SANTO DOMINGO DE ACOBAMBA","12","01","35"]
[null,"12 Junín","01 Huancayo ","36 Viques","12","01","36","Junín","Huancayo ","Viques","120136","JUNÍN","HUANCAYO","VIQUES","12","01","36"]
[null,"12 Junín","02 Concepción ","01 Concepción","12","02","01","Junín","Concepción ","Concepción","120201","JUNÍN","CONCEPCIÓN","CONCEPCIÓN","12","02","01"]
[null,"12 Junín","02 Concepción ","02 Aco","12","02","02","Junín","Concepción ","Aco","120202","JUNÍN","CONCEPCIÓN","ACO","12","02","02"]
[null,"12 Junín","02 Concepción ","03 Andamarca","12","02","03","Junín","Concepción ","Andamarca","120203","JUNÍN","CONCEPCIÓN","ANDAMARCA","12","02","03"]
[null,"12 Junín","02 Concepción ","04 Chambara","12","02","04","Junín","Concepción ","Chambara","120204","JUNÍN","CONCEPCIÓN","CHAMBARA","12","02","04"]
[null,"12 Junín","02 Concepción ","05 Cochas","12","02","05","Junín","Concepción ","Cochas","120205","JUNÍN","CONCEPCIÓN","COCHAS","12","02","05"]
[null,"12 Junín","02 Concepción ","06 Comas","12","02","06","Junín","Concepción ","Comas","120206","JUNÍN","CONCEPCIÓN","COMAS","12","02","06"]
[null,"12 Junín","02 Concepción ","07 Heroínas Toledo","12","02","07","Junín","Concepción ","Heroínas Toledo","120207","JUNÍN","CONCEPCIÓN","HEROÍNAS TOLEDO","12","02","07"]
[null,"12 Junín","02 Concepción ","08 Manzanares","12","02","08","Junín","Concepción ","Manzanares","120208","JUNÍN","CONCEPCIÓN","MANZANARES","12","02","08"]
[null,"12 Junín","02 Concepción ","09 Mariscal Castilla","12","02","09","Junín","Concepción ","Mariscal Castilla","120209","JUNÍN","CONCEPCIÓN","MARISCAL CASTILLA","12","02","09"]
[null,"12 Junín","02 Concepción ","10 Matahuasi","12","02","10","Junín","Concepción ","Matahuasi","120210","JUNÍN","CONCEPCIÓN","MATAHUASI","12","02","10"]
[null,"12 Junín","02 Concepción ","11 Mito","12","02","11","Junín","Concepción ","Mito","120211","JUNÍN","CONCEPCIÓN","MITO","12","02","11"]
[null,"12 Junín","02 Concepción ","12 Nueve de Julio","12","02","12","Junín","Concepción ","Nueve de Julio","120212","JUNÍN","CONCEPCIÓN","NUEVE DE JULIO","12","02","12"]
[null,"12 Junín","02 Concepción ","13 Orcotuna","12","02","13","Junín","Concepción ","Orcotuna","120213","JUNÍN","CONCEPCIÓN","ORCOTUNA","12","02","13"]
[null,"12 Junín","02 Concepción ","14 San José de Quero","12","02","14","Junín","Concepción ","San José de Quero","120214","JUNÍN","CONCEPCIÓN","SAN JOSÉ DE QUERO","12","02","14"]
[null,"12 Junín","02 Concepción ","15 Santa Rosa de Ocopa","12","02","15","Junín","Concepción ","Santa Rosa de Ocopa","120215","JUNÍN","CONCEPCIÓN","SANTA ROSA DE OCOPA","12","02","15"]
[null,"12 Junín","03 Chanchamayo ","01 Chanchamayo","12","03","01","Junín","Chanchamayo ","Chanchamayo","120301","JUNÍN","CHANCHAMAYO","CHANCHAMAYO","12","03","01"]
[null,"12 Junín","03 Chanchamayo ","02 Perene","12","03","02","Junín","Chanchamayo ","Perene","120302","JUNÍN","CHANCHAMAYO","PERENE","12","03","02"]
[null,"12 Junín","03 Chanchamayo ","03 Pichanaqui","12","03","03","Junín","Chanchamayo ","Pichanaqui","120303","JUNÍN","CHANCHAMAYO","PICHANAQUI","12","03","03"]
[null,"12 Junín","03 Chanchamayo ","04 San Luis de Shuaro","12","03","04","Junín","Chanchamayo ","San Luis de Shuaro","120304","JUNÍN","CHANCHAMAYO","SAN LUIS DE SHUARO","12","03","04"]
[null,"12 Junín","03 Chanchamayo ","05 San Ramón","12","03","05","Junín","Chanchamayo ","San Ramón","120305","JUNÍN","CHANCHAMAYO","SAN RAMÓN","12","03","05"]
[null,"12 Junín","03 Chanchamayo ","06 Vitoc","12","03","06","Junín","Chanchamayo ","Vitoc","120306","JUNÍN","CHANCHAMAYO","VITOC","12","03","06"]
[null,"12 Junín","04 Jauja ","01 Jauja","12","04","01","Junín","Jauja ","Jauja","120401","JUNÍN","JAUJA","JAUJA","12","04","01"]
[null,"12 Junín","04 Jauja ","02 Acolla","12","04","02","Junín","Jauja ","Acolla","120402","JUNÍN","JAUJA","ACOLLA","12","04","02"]
[null,"12 Junín","04 Jauja ","03 Apata","12","04","03","Junín","Jauja ","Apata","120403","JUNÍN","JAUJA","APATA","12","04","03"]
[null,"12 Junín","04 Jauja ","04 Ataura","12","04","04","Junín","Jauja ","Ataura","120404","JUNÍN","JAUJA","ATAURA","12","04","04"]
[null,"12 Junín","04 Jauja ","05 Canchayllo","12","04","05","Junín","Jauja ","Canchayllo","120405","JUNÍN","JAUJA","CANCHAYLLO","12","04","05"]
[null,"12 Junín","04 Jauja ","06 Curicaca","12","04","06","Junín","Jauja ","Curicaca","120406","JUNÍN","JAUJA","CURICACA","12","04","06"]
[null,"12 Junín","04 Jauja ","07 El Mantaro","12","04","07","Junín","Jauja ","El Mantaro","120407","JUNÍN","JAUJA","EL MANTARO","12","04","07"]
[null,"12 Junín","04 Jauja ","08 Huamali","12","04","08","Junín","Jauja ","Huamali","120408","JUNÍN","JAUJA","HUAMALI","12","04","08"]
[null,"12 Junín","04 Jauja ","09 Huaripampa","12","04","09","Junín","Jauja ","Huaripampa","120409","JUNÍN","JAUJA","HUARIPAMPA","12","04","09"]
[null,"12 Junín","04 Jauja ","10 Huertas","12","04","10","Junín","Jauja ","Huertas","120410","JUNÍN","JAUJA","HUERTAS","12","04","10"]
[null,"12 Junín","04 Jauja ","11 Janjaillo","12","04","11","Junín","Jauja ","Janjaillo","120411","JUNÍN","JAUJA","JANJAILLO","12","04","11"]
[null,"12 Junín","04 Jauja ","12 Julcán",{"$f":"+MID(B1092,1,2)","v":"12"},"04","12","Junín","Jauja ","Julcán",{"$f":"+CONCATENATE(E1092,F1092,G1092)","v":"120412"},"JUNÍN","JAUJA","JULCÁN","12","04","12"]
[null,"12 Junín","04 Jauja ","13 Leonor Ordóñez","12","04","13","Junín","Jauja ","Leonor Ordóñez","120413","JUNÍN","JAUJA","LEONOR ORDÓÑEZ","12","04","13"]
[null,"12 Junín","04 Jauja ","14 Llocllapampa","12","04","14","Junín","Jauja ","Llocllapampa","120414","JUNÍN","JAUJA","LLOCLLAPAMPA","12","04","14"]
[null,"12 Junín","04 Jauja ","15 Marco","12","04","15","Junín","Jauja ","Marco","120415","JUNÍN","JAUJA","MARCO","12","04","15"]
[null,"12 Junín","04 Jauja ","16 Masma","12","04","16","Junín","Jauja ","Masma","120416","JUNÍN","JAUJA","MASMA","12","04","16"]
[null,"12 Junín","04 Jauja ","17 Masma Chicche","12","04","17","Junín","Jauja ","Masma Chicche","120417","JUNÍN","JAUJA","MASMA CHICCHE","12","04","17"]
[null,"12 Junín","04 Jauja ","18 Molinos","12","04","18","Junín","Jauja ","Molinos","120418","JUNÍN","JAUJA","MOLINOS","12","04","18"]
[null,"12 Junín","04 Jauja ","19 Monobamba","12","04","19","Junín","Jauja ","Monobamba","120419","JUNÍN","JAUJA","MONOBAMBA","12","04","19"]
[null,"12 Junín","04 Jauja ","20 Muqui","12","04","20","Junín","Jauja ","Muqui","120420","JUNÍN","JAUJA","MUQUI","12","04","20"]
[null,"12 Junín","04 Jauja ","21 Muquiyauyo","12","04","21","Junín","Jauja ","Muquiyauyo","120421","JUNÍN","JAUJA","MUQUIYAUYO","12","04","21"]
[null,"12 Junín","04 Jauja ","22 Paca","12","04","22","Junín","Jauja ","Paca","120422","JUNÍN","JAUJA","PACA","12","04","22"]
[null,"12 Junín","04 Jauja ","23 Paccha","12","04","23","Junín","Jauja ","Paccha","120423","JUNÍN","JAUJA","PACCHA","12","04","23"]
[null,"12 Junín","04 Jauja ","24 Pancan","12","04","24","Junín","Jauja ","Pancan","120424","JUNÍN","JAUJA","PANCAN","12","04","24"]
[null,"12 Junín","04 Jauja ","25 Parco","12","04","25","Junín","Jauja ","Parco","120425","JUNÍN","JAUJA","PARCO","12","04","25"]
[null,"12 Junín","04 Jauja ","26 Pomacancha","12","04","26","Junín","Jauja ","Pomacancha","120426","JUNÍN","JAUJA","POMACANCHA","12","04","26"]
[null,"12 Junín","04 Jauja ","27 Ricran","12","04","27","Junín","Jauja ","Ricran","120427","JUNÍN","JAUJA","RICRAN","12","04","27"]
[null,"12 Junín","04 Jauja ","28 San Lorenzo","12","04","28","Junín","Jauja ","San Lorenzo","120428","JUNÍN","JAUJA","SAN LORENZO","12","04","28"]
[null,"12 Junín","04 Jauja ","29 San Pedro de Chunan","12","04","29","Junín","Jauja ","San Pedro de Chunan","120429","JUNÍN","JAUJA","SAN PEDRO DE CHUNAN","12","04","29"]
[null,"12 Junín","04 Jauja ","30 Sausa","12","04","30","Junín","Jauja ","Sausa","120430","JUNÍN","JAUJA","SAUSA","12","04","30"]
[null,"12 Junín","04 Jauja ","31 Sincos","12","04","31","Junín","Jauja ","Sincos","120431","JUNÍN","JAUJA","SINCOS","12","04","31"]
[null,"12 Junín","04 Jauja ","32 Tunan Marca","12","04","32","Junín","Jauja ","Tunan Marca","120432","JUNÍN","JAUJA","TUNAN MARCA","12","04","32"]
[null,"12 Junín","04 Jauja ","33 Yauli","12","04","33","Junín","Jauja ","Yauli","120433","JUNÍN","JAUJA","YAULI","12","04","33"]
[null,"12 Junín","04 Jauja ","34 Yauyos","12","04","34","Junín","Jauja ","Yauyos","120434","JUNÍN","JAUJA","YAUYOS","12","04","34"]
[null,"12 Junín","05 Junín ","01 Junin","12","05","01","Junín","Junín ","Junin","120501","JUNÍN","JUNÍN","JUNIN","12","05","01"]
[null,"12 Junín","05 Junín ","02 Carhuamayo","12","05","02","Junín","Junín ","Carhuamayo","120502","JUNÍN","JUNÍN","CARHUAMAYO","12","05","02"]
[null,"12 Junín","05 Junín ","03 Ondores","12","05","03","Junín","Junín ","Ondores","120503","JUNÍN","JUNÍN","ONDORES","12","05","03"]
[null,"12 Junín","05 Junín ","04 Ulcumayo","12","05","04","Junín","Junín ","Ulcumayo","120504","JUNÍN","JUNÍN","ULCUMAYO","12","05","04"]
[null,"12 Junín","06 Satipo ","01 Satipo","12","06","01","Junín","Satipo ","Satipo","120601","JUNÍN","SATIPO","SATIPO","12","06","01"]
[null,"12 Junín","06 Satipo ","02 Coviriali","12","06","02","Junín","Satipo ","Coviriali","120602","JUNÍN","SATIPO","COVIRIALI","12","06","02"]
[null,"12 Junín","06 Satipo ","03 Llaylla","12","06","03","Junín","Satipo ","Llaylla","120603","JUNÍN","SATIPO","LLAYLLA","12","06","03"]
[null,"12 Junín","06 Satipo ","04 Mazamari","12","06","04","Junín","Satipo ","Mazamari","120604","JUNÍN","SATIPO","MAZAMARI","12","06","04"]
[null,"12 Junín","06 Satipo ","05 Pampa Hermosa","12","06","05","Junín","Satipo ","Pampa Hermosa","120605","JUNÍN","SATIPO","PAMPA HERMOSA","12","06","05"]
[null,"12 Junín","06 Satipo ","06 Pangoa","12","06","06","Junín","Satipo ","Pangoa","120606","JUNÍN","SATIPO","PANGOA","12","06","06"]
[null,"12 Junín","06 Satipo ","07 Río Negro","12","06","07","Junín","Satipo ","Río Negro","120607","JUNÍN","SATIPO","RÍO NEGRO","12","06","07"]
[null,"12 Junín","06 Satipo ","08 Río Tambo","12","06","08","Junín","Satipo ","Río Tambo","120608","JUNÍN","SATIPO","RÍO TAMBO","12","06","08"]
[null,"12 Junín","06 Satipo ","09 Vizcatan del Ene","12","06","09","Junín","Satipo ","Vizcatan del Ene","120609","JUNÍN","SATIPO","VIZCATAN DEL ENE","12","06","09"]
[null,"12 Junín","07 Tarma ","01 Tarma","12","07","01","Junín","Tarma ","Tarma","120701","JUNÍN","TARMA","TARMA","12","07","01"]
[null,"12 Junín","07 Tarma ","02 Acobamba","12","07","02","Junín","Tarma ","Acobamba","120702","JUNÍN","TARMA","ACOBAMBA","12","07","02"]
[null,"12 Junín","07 Tarma ","03 Huaricolca","12","07","03","Junín","Tarma ","Huaricolca","120703","JUNÍN","TARMA","HUARICOLCA","12","07","03"]
[null,"12 Junín","07 Tarma ","04 Huasahuasi","12","07","04","Junín","Tarma ","Huasahuasi","120704","JUNÍN","TARMA","HUASAHUASI","12","07","04"]
[null,"12 Junín","07 Tarma ","05 La Unión","12","07","05","Junín","Tarma ","La Unión","120705","JUNÍN","TARMA","LA UNIÓN","12","07","05"]
[null,"12 Junín","07 Tarma ","06 Palca","12","07","06","Junín","Tarma ","Palca","120706","JUNÍN","TARMA","PALCA","12","07","06"]
[null,"12 Junín","07 Tarma ","07 Palcamayo","12","07","07","Junín","Tarma ","Palcamayo","120707","JUNÍN","TARMA","PALCAMAYO","12","07","07"]
[null,"12 Junín","07 Tarma ","08 San Pedro de Cajas","12","07","08","Junín","Tarma ","San Pedro de Cajas","120708","JUNÍN","TARMA","SAN PEDRO DE CAJAS","12","07","08"]
[null,"12 Junín","07 Tarma ","09 Tapo","12","07","09","Junín","Tarma ","Tapo","120709","JUNÍN","TARMA","TAPO","12","07","09"]
[null,"12 Junín","08 Yauli ","01 La Oroya","12","08","01","Junín","Yauli ","La Oroya","120801","JUNÍN","YAULI","LA OROYA","12","08","01"]
[null,"12 Junín","08 Yauli ","02 Chacapalpa","12","08","02","Junín","Yauli ","Chacapalpa","120802","JUNÍN","YAULI","CHACAPALPA","12","08","02"]
[null,"12 Junín","08 Yauli ","03 Huay-Huay","12","08","03","Junín","Yauli ","Huay-Huay","120803","JUNÍN","YAULI","HUAY-HUAY","12","08","03"]
[null,"12 Junín","08 Yauli ","04 Marcapomacocha","12","08","04","Junín","Yauli ","Marcapomacocha","120804","JUNÍN","YAULI","MARCAPOMACOCHA","12","08","04"]
[null,"12 Junín","08 Yauli ","05 Morococha","12","08","05","Junín","Yauli ","Morococha","120805","JUNÍN","YAULI","MOROCOCHA","12","08","05"]
[null,"12 Junín","08 Yauli ","06 Paccha","12","08","06","Junín","Yauli ","Paccha","120806","JUNÍN","YAULI","PACCHA","12","08","06"]
[null,"12 Junín","08 Yauli ","07 Santa Bárbara de Carhuacayan","12","08","07","Junín","Yauli ","Santa Bárbara de Carhuacayan","120807","JUNÍN","YAULI","SANTA BÁRBARA DE CARHUACAYAN","12","08","07"]
[null,"12 Junín","08 Yauli ","08 Santa Rosa de Sacco","12","08","08","Junín","Yauli ","Santa Rosa de Sacco","120808","JUNÍN","YAULI","SANTA ROSA DE SACCO","12","08","08"]
[null,"12 Junín","08 Yauli ","09 Suitucancha","12","08","09","Junín","Yauli ","Suitucancha","120809","JUNÍN","YAULI","SUITUCANCHA","12","08","09"]
[null,"12 Junín","08 Yauli ","10 Yauli","12","08","10","Junín","Yauli ","Yauli","120810","JUNÍN","YAULI","YAULI","12","08","10"]
[null,"12 Junín","09 Chupaca ","01 Chupaca","12","09","01","Junín","Chupaca ","Chupaca","120901","JUNÍN","CHUPACA","CHUPACA","12","09","01"]
[null,"12 Junín","09 Chupaca ","02 Ahuac","12","09","02","Junín","Chupaca ","Ahuac","120902","JUNÍN","CHUPACA","AHUAC","12","09","02"]
[null,"12 Junín","09 Chupaca ","03 Chongos Bajo","12","09","03","Junín","Chupaca ","Chongos Bajo","120903","JUNÍN","CHUPACA","CHONGOS BAJO","12","09","03"]
[null,"12 Junín","09 Chupaca ","04 Huachac","12","09","04","Junín","Chupaca ","Huachac","120904","JUNÍN","CHUPACA","HUACHAC","12","09","04"]
[null,"12 Junín","09 Chupaca ","05 Huamancaca Chico","12","09","05","Junín","Chupaca ","Huamancaca Chico","120905","JUNÍN","CHUPACA","HUAMANCACA CHICO","12","09","05"]
[null,"12 Junín","09 Chupaca ","06 San Juan de Iscos","12","09","06","Junín","Chupaca ","San Juan de Iscos","120906","JUNÍN","CHUPACA","SAN JUAN DE ISCOS","12","09","06"]
[null,"12 Junín","09 Chupaca ","07 San Juan de Jarpa","12","09","07","Junín","Chupaca ","San Juan de Jarpa","120907","JUNÍN","CHUPACA","SAN JUAN DE JARPA","12","09","07"]
[null,"12 Junín","09 Chupaca ","08 Tres de Diciembre","12","09","08","Junín","Chupaca ","Tres de Diciembre","120908","JUNÍN","CHUPACA","TRES DE DICIEMBRE","12","09","08"]
[null,"12 Junín","09 Chupaca ","09 Yanacancha","12","09","09","Junín","Chupaca ","Yanacancha","120909","JUNÍN","CHUPACA","YANACANCHA","12","09","09"]
[null,"13 La Libertad","01 Trujillo ","01 Trujillo",{"$f":"+MID(B1156,1,2)","v":"13"},"01","01","La Libertad","Trujillo ","Trujillo",{"$f":"+CONCATENATE(E1156,F1156,G1156)","v":"130101"},"LA LIBERTAD","TRUJILLO","TRUJILLO","13","01","01"]
[null,"13 La Libertad","01 Trujillo ","02 El Porvenir","13","01","02","La Libertad","Trujillo ","El Porvenir","130102","LA LIBERTAD","TRUJILLO","EL PORVENIR","13","01","02"]
[null,"13 La Libertad","01 Trujillo ","03 Florencia de Mora","13","01","03","La Libertad","Trujillo ","Florencia de Mora","130103","LA LIBERTAD","TRUJILLO","FLORENCIA DE MORA","13","01","03"]
[null,"13 La Libertad","01 Trujillo ","04 Huanchaco","13","01","04","La Libertad","Trujillo ","Huanchaco","130104","LA LIBERTAD","TRUJILLO","HUANCHACO","13","01","04"]
[null,"13 La Libertad","01 Trujillo ","05 La Esperanza","13","01","05","La Libertad","Trujillo ","La Esperanza","130105","LA LIBERTAD","TRUJILLO","LA ESPERANZA","13","01","05"]
[null,"13 La Libertad","01 Trujillo ","06 Laredo","13","01","06","La Libertad","Trujillo ","Laredo","130106","LA LIBERTAD","TRUJILLO","LAREDO","13","01","06"]
[null,"13 La Libertad","01 Trujillo ","07 Moche","13","01","07","La Libertad","Trujillo ","Moche","130107","LA LIBERTAD","TRUJILLO","MOCHE","13","01","07"]
[null,"13 La Libertad","01 Trujillo ","08 Poroto","13","01","08","La Libertad","Trujillo ","Poroto","130108","LA LIBERTAD","TRUJILLO","POROTO","13","01","08"]
[null,"13 La Libertad","01 Trujillo ","09 Salaverry","13","01","09","La Libertad","Trujillo ","Salaverry","130109","LA LIBERTAD","TRUJILLO","SALAVERRY","13","01","09"]
[null,"13 La Libertad","01 Trujillo ","10 Simbal","13","01","10","La Libertad","Trujillo ","Simbal","130110","LA LIBERTAD","TRUJILLO","SIMBAL","13","01","10"]
[null,"13 La Libertad","01 Trujillo ","11 Victor Larco Herrera","13","01","11","La Libertad","Trujillo ","Victor Larco Herrera","130111","LA LIBERTAD","TRUJILLO","VICTOR LARCO HERRERA","13","01","11"]
[null,"13 La Libertad","02 Ascope ","01 Ascope","13","02","01","La Libertad","Ascope ","Ascope","130201","LA LIBERTAD","ASCOPE","ASCOPE","13","02","01"]
[null,"13 La Libertad","02 Ascope ","02 Chicama","13","02","02","La Libertad","Ascope ","Chicama","130202","LA LIBERTAD","ASCOPE","CHICAMA","13","02","02"]
[null,"13 La Libertad","02 Ascope ","03 Chocope","13","02","03","La Libertad","Ascope ","Chocope","130203","LA LIBERTAD","ASCOPE","CHOCOPE","13","02","03"]
[null,"13 La Libertad","02 Ascope ","04 Magdalena de Cao","13","02","04","La Libertad","Ascope ","Magdalena de Cao","130204","LA LIBERTAD","ASCOPE","MAGDALENA DE CAO","13","02","04"]
[null,"13 La Libertad","02 Ascope ","05 Paijan","13","02","05","La Libertad","Ascope ","Paijan","130205","LA LIBERTAD","ASCOPE","PAIJAN","13","02","05"]
[null,"13 La Libertad","02 Ascope ","06 Rázuri","13","02","06","La Libertad","Ascope ","Rázuri","130206","LA LIBERTAD","ASCOPE","RÁZURI","13","02","06"]
[null,"13 La Libertad","02 Ascope ","07 Santiago de Cao","13","02","07","La Libertad","Ascope ","Santiago de Cao","130207","LA LIBERTAD","ASCOPE","SANTIAGO DE CAO","13","02","07"]
[null,"13 La Libertad","02 Ascope ","08 Casa Grande","13","02","08","La Libertad","Ascope ","Casa Grande","130208","LA LIBERTAD","ASCOPE","CASA GRANDE","13","02","08"]
[null,"13 La Libertad","03 Bolívar ","01 Bolívar","13","03","01","La Libertad","Bolívar ","Bolívar","130301","LA LIBERTAD","BOLÍVAR","BOLÍVAR","13","03","01"]
[null,"13 La Libertad","03 Bolívar ","02 Bambamarca","13","03","02","La Libertad","Bolívar ","Bambamarca","130302","LA LIBERTAD","BOLÍVAR","BAMBAMARCA","13","03","02"]
[null,"13 La Libertad","03 Bolívar ","03 Condormarca","13","03","03","La Libertad","Bolívar ","Condormarca","130303","LA LIBERTAD","BOLÍVAR","CONDORMARCA","13","03","03"]
[null,"13 La Libertad","03 Bolívar ","04 Longotea","13","03","04","La Libertad","Bolívar ","Longotea","130304","LA LIBERTAD","BOLÍVAR","LONGOTEA","13","03","04"]
[null,"13 La Libertad","03 Bolívar ","05 Uchumarca","13","03","05","La Libertad","Bolívar ","Uchumarca","130305","LA LIBERTAD","BOLÍVAR","UCHUMARCA","13","03","05"]
[null,"13 La Libertad","03 Bolívar ","06 Ucuncha","13","03","06","La Libertad","Bolívar ","Ucuncha","130306","LA LIBERTAD","BOLÍVAR","UCUNCHA","13","03","06"]
[null,"13 La Libertad","04 Chepén ","01 Chepen","13","04","01","La Libertad","Chepén ","Chepen","130401","LA LIBERTAD","CHEPÉN","CHEPEN","13","04","01"]
[null,"13 La Libertad","04 Chepén ","02 Pacanga","13","04","02","La Libertad","Chepén ","Pacanga","130402","LA LIBERTAD","CHEPÉN","PACANGA","13","04","02"]
[null,"13 La Libertad","04 Chepén ","03 Pueblo Nuevo","13","04","03","La Libertad","Chepén ","Pueblo Nuevo","130403","LA LIBERTAD","CHEPÉN","PUEBLO NUEVO","13","04","03"]
[null,"13 La Libertad","05 Julcán ","01 Julcan","13","05","01","La Libertad","Julcán ","Julcan","130501","LA LIBERTAD","JULCÁN","JULCAN","13","05","01"]
[null,"13 La Libertad","05 Julcán ","02 Calamarca","13","05","02","La Libertad","Julcán ","Calamarca","130502","LA LIBERTAD","JULCÁN","CALAMARCA","13","05","02"]
[null,"13 La Libertad","05 Julcán ","03 Carabamba","13","05","03","La Libertad","Julcán ","Carabamba","130503","LA LIBERTAD","JULCÁN","CARABAMBA","13","05","03"]
[null,"13 La Libertad","05 Julcán ","04 Huaso","13","05","04","La Libertad","Julcán ","Huaso","130504","LA LIBERTAD","JULCÁN","HUASO","13","05","04"]
[null,"13 La Libertad","06 Otuzco ","01 Otuzco","13","06","01","La Libertad","Otuzco ","Otuzco","130601","LA LIBERTAD","OTUZCO","OTUZCO","13","06","01"]
[null,"13 La Libertad","06 Otuzco ","02 Agallpampa","13","06","02","La Libertad","Otuzco ","Agallpampa","130602","LA LIBERTAD","OTUZCO","AGALLPAMPA","13","06","02"]
[null,"13 La Libertad","06 Otuzco ","04 Charat","13","06","04","La Libertad","Otuzco ","Charat","130604","LA LIBERTAD","OTUZCO","CHARAT","13","06","04"]
[null,"13 La Libertad","06 Otuzco ","05 Huaranchal","13","06","05","La Libertad","Otuzco ","Huaranchal","130605","LA LIBERTAD","OTUZCO","HUARANCHAL","13","06","05"]
[null,"13 La Libertad","06 Otuzco ","06 La Cuesta","13","06","06","La Libertad","Otuzco ","La Cuesta","130606","LA LIBERTAD","OTUZCO","LA CUESTA","13","06","06"]
[null,"13 La Libertad","06 Otuzco ","08 Mache","13","06","08","La Libertad","Otuzco ","Mache","130608","LA LIBERTAD","OTUZCO","MACHE","13","06","08"]
[null,"13 La Libertad","06 Otuzco ","10 Paranday","13","06","10","La Libertad","Otuzco ","Paranday","130610","LA LIBERTAD","OTUZCO","PARANDAY","13","06","10"]
[null,"13 La Libertad","06 Otuzco ","11 Salpo","13","06","11","La Libertad","Otuzco ","Salpo","130611","LA LIBERTAD","OTUZCO","SALPO","13","06","11"]
[null,"13 La Libertad","06 Otuzco ","13 Sinsicap","13","06","13","La Libertad","Otuzco ","Sinsicap","130613","LA LIBERTAD","OTUZCO","SINSICAP","13","06","13"]
[null,"13 La Libertad","06 Otuzco ","14 Usquil","13","06","14","La Libertad","Otuzco ","Usquil","130614","LA LIBERTAD","OTUZCO","USQUIL","13","06","14"]
[null,"13 La Libertad","07 Pacasmayo ","01 San Pedro de Lloc","13","07","01","La Libertad","Pacasmayo ","San Pedro de Lloc","130701","LA LIBERTAD","PACASMAYO","SAN PEDRO DE LLOC","13","07","01"]
[null,"13 La Libertad","07 Pacasmayo ","02 Guadalupe","13","07","02","La Libertad","Pacasmayo ","Guadalupe","130702","LA LIBERTAD","PACASMAYO","GUADALUPE","13","07","02"]
[null,"13 La Libertad","07 Pacasmayo ","03 Jequetepeque","13","07","03","La Libertad","Pacasmayo ","Jequetepeque","130703","LA LIBERTAD","PACASMAYO","JEQUETEPEQUE","13","07","03"]
[null,"13 La Libertad","07 Pacasmayo ","04 Pacasmayo","13","07","04","La Libertad","Pacasmayo ","Pacasmayo","130704","LA LIBERTAD","PACASMAYO","PACASMAYO","13","07","04"]
[null,"13 La Libertad","07 Pacasmayo ","05 San José","13","07","05","La Libertad","Pacasmayo ","San José","130705","LA LIBERTAD","PACASMAYO","SAN JOSÉ","13","07","05"]
[null,"13 La Libertad","08 Pataz ","01 Tayabamba","13","08","01","La Libertad","Pataz ","Tayabamba","130801","LA LIBERTAD","PATAZ","TAYABAMBA","13","08","01"]
[null,"13 La Libertad","08 Pataz ","02 Buldibuyo","13","08","02","La Libertad","Pataz ","Buldibuyo","130802","LA LIBERTAD","PATAZ","BULDIBUYO","13","08","02"]
[null,"13 La Libertad","08 Pataz ","03 Chillia","13","08","03","La Libertad","Pataz ","Chillia","130803","LA LIBERTAD","PATAZ","CHILLIA","13","08","03"]
[null,"13 La Libertad","08 Pataz ","04 Huancaspata","13","08","04","La Libertad","Pataz ","Huancaspata","130804","LA LIBERTAD","PATAZ","HUANCASPATA","13","08","04"]
[null,"13 La Libertad","08 Pataz ","05 Huaylillas","13","08","05","La Libertad","Pataz ","Huaylillas","130805","LA LIBERTAD","PATAZ","HUAYLILLAS","13","08","05"]
[null,"13 La Libertad","08 Pataz ","06 Huayo","13","08","06","La Libertad","Pataz ","Huayo","130806","LA LIBERTAD","PATAZ","HUAYO","13","08","06"]
[null,"13 La Libertad","08 Pataz ","07 Ongon","13","08","07","La Libertad","Pataz ","Ongon","130807","LA LIBERTAD","PATAZ","ONGON","13","08","07"]
[null,"13 La Libertad","08 Pataz ","08 Parcoy","13","08","08","La Libertad","Pataz ","Parcoy","130808","LA LIBERTAD","PATAZ","PARCOY","13","08","08"]
[null,"13 La Libertad","08 Pataz ","09 Pataz","13","08","09","La Libertad","Pataz ","Pataz","130809","LA LIBERTAD","PATAZ","PATAZ","13","08","09"]
[null,"13 La Libertad","08 Pataz ","10 Pias","13","08","10","La Libertad","Pataz ","Pias","130810","LA LIBERTAD","PATAZ","PIAS","13","08","10"]
[null,"13 La Libertad","08 Pataz ","11 Santiago de Challas","13","08","11","La Libertad","Pataz ","Santiago de Challas","130811","LA LIBERTAD","PATAZ","SANTIAGO DE CHALLAS","13","08","11"]
[null,"13 La Libertad","08 Pataz ","12 Taurija","13","08","12","La Libertad","Pataz ","Taurija","130812","LA LIBERTAD","PATAZ","TAURIJA","13","08","12"]
[null,"13 La Libertad","08 Pataz ","13 Urpay","13","08","13","La Libertad","Pataz ","Urpay","130813","LA LIBERTAD","PATAZ","URPAY","13","08","13"]
[null,"13 La Libertad","09 Sánchez Carrión ","01 Huamachuco","13","09","01","La Libertad","Sánchez Carrión ","Huamachuco","130901","LA LIBERTAD","SÁNCHEZ CARRIÓN","HUAMACHUCO","13","09","01"]
[null,"13 La Libertad","09 Sánchez Carrión ","02 Chugay","13","09","02","La Libertad","Sánchez Carrión ","Chugay","130902","LA LIBERTAD","SÁNCHEZ CARRIÓN","CHUGAY","13","09","02"]
[null,"13 La Libertad","09 Sánchez Carrión ","03 Cochorco","13","09","03","La Libertad","Sánchez Carrión ","Cochorco","130903","LA LIBERTAD","SÁNCHEZ CARRIÓN","COCHORCO","13","09","03"]
[null,"13 La Libertad","09 Sánchez Carrión ","04 Curgos","13","09","04","La Libertad","Sánchez Carrión ","Curgos","130904","LA LIBERTAD","SÁNCHEZ CARRIÓN","CURGOS","13","09","04"]
[null,"13 La Libertad","09 Sánchez Carrión ","05 Marcabal",{"$f":"+MID(B1220,1,2)","v":"13"},"09","05","La Libertad","Sánchez Carrión ","Marcabal",{"$f":"+CONCATENATE(E1220,F1220,G1220)","v":"130905"},"LA LIBERTAD","SÁNCHEZ CARRIÓN","MARCABAL","13","09","05"]
[null,"13 La Libertad","09 Sánchez Carrión ","06 Sanagoran","13","09","06","La Libertad","Sánchez Carrión ","Sanagoran","130906","LA LIBERTAD","SÁNCHEZ CARRIÓN","SANAGORAN","13","09","06"]
[null,"13 La Libertad","09 Sánchez Carrión ","07 Sarin","13","09","07","La Libertad","Sánchez Carrión ","Sarin","130907","LA LIBERTAD","SÁNCHEZ CARRIÓN","SARIN","13","09","07"]
[null,"13 La Libertad","09 Sánchez Carrión ","08 Sartimbamba","13","09","08","La Libertad","Sánchez Carrión ","Sartimbamba","130908","LA LIBERTAD","SÁNCHEZ CARRIÓN","SARTIMBAMBA","13","09","08"]
[null,"13 La Libertad","10 Santiago de Chuco ","01 Santiago de Chuco","13","10","01","La Libertad","Santiago de Chuco ","Santiago de Chuco","131001","LA LIBERTAD","SANTIAGO DE CHUCO","SANTIAGO DE CHUCO","13","10","01"]
[null,"13 La Libertad","10 Santiago de Chuco ","02 Angasmarca","13","10","02","La Libertad","Santiago de Chuco ","Angasmarca","131002","LA LIBERTAD","SANTIAGO DE CHUCO","ANGASMARCA","13","10","02"]
[null,"13 La Libertad","10 Santiago de Chuco ","03 Cachicadan","13","10","03","La Libertad","Santiago de Chuco ","Cachicadan","131003","LA LIBERTAD","SANTIAGO DE CHUCO","CACHICADAN","13","10","03"]
[null,"13 La Libertad","10 Santiago de Chuco ","04 Mollebamba","13","10","04","La Libertad","Santiago de Chuco ","Mollebamba","131004","LA LIBERTAD","SANTIAGO DE CHUCO","MOLLEBAMBA","13","10","04"]
[null,"13 La Libertad","10 Santiago de Chuco ","05 Mollepata","13","10","05","La Libertad","Santiago de Chuco ","Mollepata","131005","LA LIBERTAD","SANTIAGO DE CHUCO","MOLLEPATA","13","10","05"]
[null,"13 La Libertad","10 Santiago de Chuco ","06 Quiruvilca","13","10","06","La Libertad","Santiago de Chuco ","Quiruvilca","131006","LA LIBERTAD","SANTIAGO DE CHUCO","QUIRUVILCA","13","10","06"]
[null,"13 La Libertad","10 Santiago de Chuco ","07 Santa Cruz de Chuca","13","10","07","La Libertad","Santiago de Chuco ","Santa Cruz de Chuca","131007","LA LIBERTAD","SANTIAGO DE CHUCO","SANTA CRUZ DE CHUCA","13","10","07"]
[null,"13 La Libertad","10 Santiago de Chuco ","08 Sitabamba","13","10","08","La Libertad","Santiago de Chuco ","Sitabamba","131008","LA LIBERTAD","SANTIAGO DE CHUCO","SITABAMBA","13","10","08"]
[null,"13 La Libertad","11 Gran Chimú ","01 Cascas","13","11","01","La Libertad","Gran Chimú ","Cascas","131101","LA LIBERTAD","GRAN CHIMÚ","CASCAS","13","11","01"]
[null,"13 La Libertad","11 Gran Chimú ","02 Lucma","13","11","02","La Libertad","Gran Chimú ","Lucma","131102","LA LIBERTAD","GRAN CHIMÚ","LUCMA","13","11","02"]
[null,"13 La Libertad","11 Gran Chimú ","03 Marmot","13","11","03","La Libertad","Gran Chimú ","Marmot","131103","LA LIBERTAD","GRAN CHIMÚ","MARMOT","13","11","03"]
[null,"13 La Libertad","11 Gran Chimú ","04 Sayapullo","13","11","04","La Libertad","Gran Chimú ","Sayapullo","131104","LA LIBERTAD","GRAN CHIMÚ","SAYAPULLO","13","11","04"]
[null,"13 La Libertad","12 Virú ","01 Viru","13","12","01","La Libertad","Virú ","Viru","131201","LA LIBERTAD","VIRÚ","VIRU","13","12","01"]
[null,"13 La Libertad","12 Virú ","02 Chao","13","12","02","La Libertad","Virú ","Chao","131202","LA LIBERTAD","VIRÚ","CHAO","13","12","02"]
[null,"13 La Libertad","12 Virú ","03 Guadalupito","13","12","03","La Libertad","Virú ","Guadalupito","131203","LA LIBERTAD","VIRÚ","GUADALUPITO","13","12","03"]
[null,"14 Lambayeque","01 Chiclayo ","01 Chiclayo","14","01","01","Lambayeque","Chiclayo ","Chiclayo","140101","LAMBAYEQUE","CHICLAYO","CHICLAYO","14","01","01"]
[null,"14 Lambayeque","01 Chiclayo ","02 Chongoyape","14","01","02","Lambayeque","Chiclayo ","Chongoyape","140102","LAMBAYEQUE","CHICLAYO","CHONGOYAPE","14","01","02"]
[null,"14 Lambayeque","01 Chiclayo ","03 Eten","14","01","03","Lambayeque","Chiclayo ","Eten","140103","LAMBAYEQUE","CHICLAYO","ETEN","14","01","03"]
[null,"14 Lambayeque","01 Chiclayo ","04 Eten Puerto","14","01","04","Lambayeque","Chiclayo ","Eten Puerto","140104","LAMBAYEQUE","CHICLAYO","ETEN PUERTO","14","01","04"]
[null,"14 Lambayeque","01 Chiclayo ","05 José Leonardo Ortiz","14","01","05","Lambayeque","Chiclayo ","José Leonardo Ortiz","140105","LAMBAYEQUE","CHICLAYO","JOSÉ LEONARDO ORTIZ","14","01","05"]
[null,"14 Lambayeque","01 Chiclayo ","06 La Victoria","14","01","06","Lambayeque","Chiclayo ","La Victoria","140106","LAMBAYEQUE","CHICLAYO","LA VICTORIA","14","01","06"]
[null,"14 Lambayeque","01 Chiclayo ","07 Lagunas","14","01","07","Lambayeque","Chiclayo ","Lagunas","140107","LAMBAYEQUE","CHICLAYO","LAGUNAS","14","01","07"]
[null,"14 Lambayeque","01 Chiclayo ","08 Monsefu","14","01","08","Lambayeque","Chiclayo ","Monsefu","140108","LAMBAYEQUE","CHICLAYO","MONSEFU","14","01","08"]
[null,"14 Lambayeque","01 Chiclayo ","09 Nueva Arica","14","01","09","Lambayeque","Chiclayo ","Nueva Arica","140109","LAMBAYEQUE","CHICLAYO","NUEVA ARICA","14","01","09"]
[null,"14 Lambayeque","01 Chiclayo ","10 Oyotun","14","01","10","Lambayeque","Chiclayo ","Oyotun","140110","LAMBAYEQUE","CHICLAYO","OYOTUN","14","01","10"]
[null,"14 Lambayeque","01 Chiclayo ","11 Picsi","14","01","11","Lambayeque","Chiclayo ","Picsi","140111","LAMBAYEQUE","CHICLAYO","PICSI","14","01","11"]
[null,"14 Lambayeque","01 Chiclayo ","12 Pimentel","14","01","12","Lambayeque","Chiclayo ","Pimentel","140112","LAMBAYEQUE","CHICLAYO","PIMENTEL","14","01","12"]
[null,"14 Lambayeque","01 Chiclayo ","13 Reque","14","01","13","Lambayeque","Chiclayo ","Reque","140113","LAMBAYEQUE","CHICLAYO","REQUE","14","01","13"]
[null,"14 Lambayeque","01 Chiclayo ","14 Santa Rosa","14","01","14","Lambayeque","Chiclayo ","Santa Rosa","140114","LAMBAYEQUE","CHICLAYO","SANTA ROSA","14","01","14"]
[null,"14 Lambayeque","01 Chiclayo ","15 Saña","14","01","15","Lambayeque","Chiclayo ","Saña","140115","LAMBAYEQUE","CHICLAYO","SAÑA","14","01","15"]
[null,"14 Lambayeque","01 Chiclayo ","16 Cayalti","14","01","16","Lambayeque","Chiclayo ","Cayalti","140116","LAMBAYEQUE","CHICLAYO","CAYALTI","14","01","16"]
[null,"14 Lambayeque","01 Chiclayo ","17 Patapo","14","01","17","Lambayeque","Chiclayo ","Patapo","140117","LAMBAYEQUE","CHICLAYO","PATAPO","14","01","17"]
[null,"14 Lambayeque","01 Chiclayo ","18 Pomalca","14","01","18","Lambayeque","Chiclayo ","Pomalca","140118","LAMBAYEQUE","CHICLAYO","POMALCA","14","01","18"]
[null,"14 Lambayeque","01 Chiclayo ","19 Pucala","14","01","19","Lambayeque","Chiclayo ","Pucala","140119","LAMBAYEQUE","CHICLAYO","PUCALA","14","01","19"]
[null,"14 Lambayeque","01 Chiclayo ","20 Tuman","14","01","20","Lambayeque","Chiclayo ","Tuman","140120","LAMBAYEQUE","CHICLAYO","TUMAN","14","01","20"]
[null,"14 Lambayeque","02 Ferreñafe ","01 Ferreñafe","14","02","01","Lambayeque","Ferreñafe ","Ferreñafe","140201","LAMBAYEQUE","FERREÑAFE","FERREÑAFE","14","02","01"]
[null,"14 Lambayeque","02 Ferreñafe ","02 Cañaris","14","02","02","Lambayeque","Ferreñafe ","Cañaris","140202","LAMBAYEQUE","FERREÑAFE","CAÑARIS","14","02","02"]
[null,"14 Lambayeque","02 Ferreñafe ","03 Incahuasi","14","02","03","Lambayeque","Ferreñafe ","Incahuasi","140203","LAMBAYEQUE","FERREÑAFE","INCAHUASI","14","02","03"]
[null,"14 Lambayeque","02 Ferreñafe ","04 Manuel Antonio Mesones Muro","14","02","04","Lambayeque","Ferreñafe ","Manuel Antonio Mesones Muro","140204","LAMBAYEQUE","FERREÑAFE","MANUEL ANTONIO MESONES MURO","14","02","04"]
[null,"14 Lambayeque","02 Ferreñafe ","05 Pitipo","14","02","05","Lambayeque","Ferreñafe ","Pitipo","140205","LAMBAYEQUE","FERREÑAFE","PITIPO","14","02","05"]
[null,"14 Lambayeque","02 Ferreñafe ","06 Pueblo Nuevo","14","02","06","Lambayeque","Ferreñafe ","Pueblo Nuevo","140206","LAMBAYEQUE","FERREÑAFE","PUEBLO NUEVO","14","02","06"]
[null,"14 Lambayeque","03 Lambayeque ","01 Lambayeque","14","03","01","Lambayeque","Lambayeque ","Lambayeque","140301","LAMBAYEQUE","LAMBAYEQUE","LAMBAYEQUE","14","03","01"]
[null,"14 Lambayeque","03 Lambayeque ","02 Chochope","14","03","02","Lambayeque","Lambayeque ","Chochope","140302","LAMBAYEQUE","LAMBAYEQUE","CHOCHOPE","14","03","02"]
[null,"14 Lambayeque","03 Lambayeque ","03 Illimo","14","03","03","Lambayeque","Lambayeque ","Illimo","140303","LAMBAYEQUE","LAMBAYEQUE","ILLIMO","14","03","03"]
[null,"14 Lambayeque","03 Lambayeque ","04 Jayanca","14","03","04","Lambayeque","Lambayeque ","Jayanca","140304","LAMBAYEQUE","LAMBAYEQUE","JAYANCA","14","03","04"]
[null,"14 Lambayeque","03 Lambayeque ","05 Mochumi","14","03","05","Lambayeque","Lambayeque ","Mochumi","140305","LAMBAYEQUE","LAMBAYEQUE","MOCHUMI","14","03","05"]
[null,"14 Lambayeque","03 Lambayeque ","06 Morrope","14","03","06","Lambayeque","Lambayeque ","Morrope","140306","LAMBAYEQUE","LAMBAYEQUE","MORROPE","14","03","06"]
[null,"14 Lambayeque","03 Lambayeque ","07 Motupe","14","03","07","Lambayeque","Lambayeque ","Motupe","140307","LAMBAYEQUE","LAMBAYEQUE","MOTUPE","14","03","07"]
[null,"14 Lambayeque","03 Lambayeque ","08 Olmos","14","03","08","Lambayeque","Lambayeque ","Olmos","140308","LAMBAYEQUE","LAMBAYEQUE","OLMOS","14","03","08"]
[null,"14 Lambayeque","03 Lambayeque ","09 Pacora","14","03","09","Lambayeque","Lambayeque ","Pacora","140309","LAMBAYEQUE","LAMBAYEQUE","PACORA","14","03","09"]
[null,"14 Lambayeque","03 Lambayeque ","10 Salas","14","03","10","Lambayeque","Lambayeque ","Salas","140310","LAMBAYEQUE","LAMBAYEQUE","SALAS","14","03","10"]
[null,"14 Lambayeque","03 Lambayeque ","11 San José","14","03","11","Lambayeque","Lambayeque ","San José","140311","LAMBAYEQUE","LAMBAYEQUE","SAN JOSÉ","14","03","11"]
[null,"14 Lambayeque","03 Lambayeque ","12 Tucume","14","03","12","Lambayeque","Lambayeque ","Tucume","140312","LAMBAYEQUE","LAMBAYEQUE","TUCUME","14","03","12"]
[null,"07 Callao","01 Prov. Const. del Callao","01 Callao","07","01","01","Callao","Prov. Const. del Callao","Callao","070101","LIMA","CALLAO","CALLAO","07","01","01"]
[null,"07 Callao","01 Prov. Const. del Callao","02 Bellavista","07","01","02","Callao","Prov. Const. del Callao","Bellavista","070102","LIMA","CALLAO","BELLAVISTA","07","01","02"]
[null,"07 Callao","01 Prov. Const. del Callao","03 Carmen de la Legua Reynoso","07","01","03","Callao","Prov. Const. del Callao","Carmen de la Legua Reynoso","070103","LIMA","CALLAO","CARMEN DE LA LEGUA REYNOSO","07","01","03"]
[null,"07 Callao","01 Prov. Const. del Callao","04 La Perla","07","01","04","Callao","Prov. Const. del Callao","La Perla","070104","LIMA","CALLAO","LA PERLA","07","01","04"]
[null,"07 Callao","01 Prov. Const. del Callao","05 La Punta","07","01","05","Callao","Prov. Const. del Callao","La Punta","070105","LIMA","CALLAO","LA PUNTA","07","01","05"]
[null,"07 Callao","01 Prov. Const. del Callao","06 Ventanilla","07","01","06","Callao","Prov. Const. del Callao","Ventanilla","070106","LIMA","CALLAO","VENTANILLA","07","01","06"]
[null,"07 Callao","01 Prov. Const. del Callao","07 Mi Perú","07","01","07","Callao","Prov. Const. del Callao","Mi Perú","070107","LIMA","CALLAO","MI PERÚ","07","01","07"]
[null,"15 Lima","01 Lima ","01 Lima",{"$f":"+MID(B1284,1,2)","v":"15"},"01","01","Lima","Lima ","Lima",{"$f":"+CONCATENATE(E1284,F1284,G1284)","v":"150101"},"LIMA","LIMA","LIMA","15","01","01"]
[null,"15 Lima","01 Lima ","02 Ancón","15","01","02","Lima","Lima ","Ancón","150102","LIMA","LIMA","ANCÓN","15","01","02"]
[null,"15 Lima","01 Lima ","03 Ate","15","01","03","Lima","Lima ","Ate","150103","LIMA","LIMA","ATE","15","01","03"]
[null,"15 Lima","01 Lima ","04 Barranco","15","01","04","Lima","Lima ","Barranco","150104","LIMA","LIMA","BARRANCO","15","01","04"]
[null,"15 Lima","01 Lima ","05 Breña","15","01","05","Lima","Lima ","Breña","150105","LIMA","LIMA","BREÑA","15","01","05"]
[null,"15 Lima","01 Lima ","06 Carabayllo","15","01","06","Lima","Lima ","Carabayllo","150106","LIMA","LIMA","CARABAYLLO","15","01","06"]
[null,"15 Lima","01 Lima ","07 Chaclacayo","15","01","07","Lima","Lima ","Chaclacayo","150107","LIMA","LIMA","CHACLACAYO","15","01","07"]
[null,"15 Lima","01 Lima ","08 Chorrillos","15","01","08","Lima","Lima ","Chorrillos","150108","LIMA","LIMA","CHORRILLOS","15","01","08"]
[null,"15 Lima","01 Lima ","09 Cieneguilla","15","01","09","Lima","Lima ","Cieneguilla","150109","LIMA","LIMA","CIENEGUILLA","15","01","09"]
[null,"15 Lima","01 Lima ","10 Comas","15","01","10","Lima","Lima ","Comas","150110","LIMA","LIMA","COMAS","15","01","10"]
[null,"15 Lima","01 Lima ","11 El Agustino","15","01","11","Lima","Lima ","El Agustino","150111","LIMA","LIMA","EL AGUSTINO","15","01","11"]
[null,"15 Lima","01 Lima ","12 Independencia","15","01","12","Lima","Lima ","Independencia","150112","LIMA","LIMA","INDEPENDENCIA","15","01","12"]
[null,"15 Lima","01 Lima ","13 Jesús María","15","01","13","Lima","Lima ","Jesús María","150113","LIMA","LIMA","JESÚS MARÍA","15","01","13"]
[null,"15 Lima","01 Lima ","14 La Molina","15","01","14","Lima","Lima ","La Molina","150114","LIMA","LIMA","LA MOLINA","15","01","14"]
[null,"15 Lima","01 Lima ","15 La Victoria","15","01","15","Lima","Lima ","La Victoria","150115","LIMA","LIMA","LA VICTORIA","15","01","15"]
[null,"15 Lima","01 Lima ","16 Lince","15","01","16","Lima","Lima ","Lince","150116","LIMA","LIMA","LINCE","15","01","16"]
[null,"15 Lima","01 Lima ","17 Los Olivos","15","01","17","Lima","Lima ","Los Olivos","150117","LIMA","LIMA","LOS OLIVOS","15","01","17"]
[null,"15 Lima","01 Lima ","18 Lurigancho","15","01","18","Lima","Lima ","Lurigancho","150118","LIMA","LIMA","LURIGANCHO","15","01","18"]
[null,"15 Lima","01 Lima ","19 Lurin","15","01","19","Lima","Lima ","Lurin","150119","LIMA","LIMA","LURIN","15","01","19"]
[null,"15 Lima","01 Lima ","20 Magdalena del Mar","15","01","20","Lima","Lima ","Magdalena del Mar","150120","LIMA","LIMA","MAGDALENA DEL MAR","15","01","20"]
[null,"15 Lima","01 Lima ","21 Pueblo Libre","15","01","21","Lima","Lima ","Pueblo Libre","150121","LIMA","LIMA","PUEBLO LIBRE","15","01","21"]
[null,"15 Lima","01 Lima ","22 Miraflores","15","01","22","Lima","Lima ","Miraflores","150122","LIMA","LIMA","MIRAFLORES","15","01","22"]
[null,"15 Lima","01 Lima ","23 Pachacamac","15","01","23","Lima","Lima ","Pachacamac","150123","LIMA","LIMA","PACHACAMAC","15","01","23"]
[null,"15 Lima","01 Lima ","24 Pucusana","15","01","24","Lima","Lima ","Pucusana","150124","LIMA","LIMA","PUCUSANA","15","01","24"]
[null,"15 Lima","01 Lima ","25 Puente Piedra","15","01","25","Lima","Lima ","Puente Piedra","150125","LIMA","LIMA","PUENTE PIEDRA","15","01","25"]
[null,"15 Lima","01 Lima ","26 Punta Hermosa","15","01","26","Lima","Lima ","Punta Hermosa","150126","LIMA","LIMA","PUNTA HERMOSA","15","01","26"]
[null,"15 Lima","01 Lima ","27 Punta Negra","15","01","27","Lima","Lima ","Punta Negra","150127","LIMA","LIMA","PUNTA NEGRA","15","01","27"]
[null,"15 Lima","01 Lima ","28 Rímac","15","01","28","Lima","Lima ","Rímac","150128","LIMA","LIMA","RÍMAC","15","01","28"]
[null,"15 Lima","01 Lima ","29 San Bartolo","15","01","29","Lima","Lima ","San Bartolo","150129","LIMA","LIMA","SAN BARTOLO","15","01","29"]
[null,"15 Lima","01 Lima ","30 San Borja","15","01","30","Lima","Lima ","San Borja","150130","LIMA","LIMA","SAN BORJA","15","01","30"]
[null,"15 Lima","01 Lima ","31 San Isidro","15","01","31","Lima","Lima ","San Isidro","150131","LIMA","LIMA","SAN ISIDRO","15","01","31"]
[null,"15 Lima","01 Lima ","32 San Juan de Lurigancho","15","01","32","Lima","Lima ","San Juan de Lurigancho","150132","LIMA","LIMA","SAN JUAN DE LURIGANCHO","15","01","32"]
[null,"15 Lima","01 Lima ","33 San Juan de Miraflores","15","01","33","Lima","Lima ","San Juan de Miraflores","150133","LIMA","LIMA","SAN JUAN DE MIRAFLORES","15","01","33"]
[null,"15 Lima","01 Lima ","34 San Luis","15","01","34","Lima","Lima ","San Luis","150134","LIMA","LIMA","SAN LUIS","15","01","34"]
[null,"15 Lima","01 Lima ","35 San Martín de Porres","15","01","35","Lima","Lima ","San Martín de Porres","150135","LIMA","LIMA","SAN MARTÍN DE PORRES","15","01","35"]
[null,"15 Lima","01 Lima ","36 San Miguel","15","01","36","Lima","Lima ","San Miguel","150136","LIMA","LIMA","SAN MIGUEL","15","01","36"]
[null,"15 Lima","01 Lima ","37 Santa Anita","15","01","37","Lima","Lima ","Santa Anita","150137","LIMA","LIMA","SANTA ANITA","15","01","37"]
[null,"15 Lima","01 Lima ","38 Santa María del Mar","15","01","38","Lima","Lima ","Santa María del Mar","150138","LIMA","LIMA","SANTA MARÍA DEL MAR","15","01","38"]
[null,"15 Lima","01 Lima ","39 Santa Rosa","15","01","39","Lima","Lima ","Santa Rosa","150139","LIMA","LIMA","SANTA ROSA","15","01","39"]
[null,"15 Lima","01 Lima ","40 Santiago de Surco","15","01","40","Lima","Lima ","Santiago de Surco","150140","LIMA","LIMA","SANTIAGO DE SURCO","15","01","40"]
[null,"15 Lima","01 Lima ","41 Surquillo","15","01","41","Lima","Lima ","Surquillo","150141","LIMA","LIMA","SURQUILLO","15","01","41"]
[null,"15 Lima","01 Lima ","42 Villa El Salvador","15","01","42","Lima","Lima ","Villa El Salvador","150142","LIMA","LIMA","VILLA EL SALVADOR","15","01","42"]
[null,"15 Lima","01 Lima ","43 Villa María del Triunfo","15","01","43","Lima","Lima ","Villa María del Triunfo","150143","LIMA","LIMA","VILLA MARÍA DEL TRIUNFO","15","01","43"]
[null,"15 Lima","02 Barranca ","01 Barranca","15","02","01","Lima","Barranca ","Barranca","150201","LIMA","BARRANCA","BARRANCA","15","02","01"]
[null,"15 Lima","02 Barranca ","02 Paramonga","15","02","02","Lima","Barranca ","Paramonga","150202","LIMA","BARRANCA","PARAMONGA","15","02","02"]
[null,"15 Lima","02 Barranca ","03 Pativilca","15","02","03","Lima","Barranca ","Pativilca","150203","LIMA","BARRANCA","PATIVILCA","15","02","03"]
[null,"15 Lima","02 Barranca ","04 Supe","15","02","04","Lima","Barranca ","Supe","150204","LIMA","BARRANCA","SUPE","15","02","04"]
[null,"15 Lima","02 Barranca ","05 Supe Puerto","15","02","05","Lima","Barranca ","Supe Puerto","150205","LIMA","BARRANCA","SUPE PUERTO","15","02","05"]
[null,"15 Lima","03 Cajatambo ","01 Cajatambo","15","03","01","Lima","Cajatambo ","Cajatambo","150301","LIMA","CAJATAMBO","CAJATAMBO","15","03","01"]
[null,"15 Lima","03 Cajatambo ","02 Copa","15","03","02","Lima","Cajatambo ","Copa","150302","LIMA","CAJATAMBO","COPA","15","03","02"]
[null,"15 Lima","03 Cajatambo ","03 Gorgor","15","03","03","Lima","Cajatambo ","Gorgor","150303","LIMA","CAJATAMBO","GORGOR","15","03","03"]
[null,"15 Lima","03 Cajatambo ","04 Huancapon","15","03","04","Lima","Cajatambo ","Huancapon","150304","LIMA","CAJATAMBO","HUANCAPON","15","03","04"]
[null,"15 Lima","03 Cajatambo ","05 Manas","15","03","05","Lima","Cajatambo ","Manas","150305","LIMA","CAJATAMBO","MANAS","15","03","05"]
[null,"15 Lima","04 Canta ","01 Canta","15","04","01","Lima","Canta ","Canta","150401","LIMA","CANTA","CANTA","15","04","01"]
[null,"15 Lima","04 Canta ","02 Arahuay","15","04","02","Lima","Canta ","Arahuay","150402","LIMA","CANTA","ARAHUAY","15","04","02"]
[null,"15 Lima","04 Canta ","03 Huamantanga","15","04","03","Lima","Canta ","Huamantanga","150403","LIMA","CANTA","HUAMANTANGA","15","04","03"]
[null,"15 Lima","04 Canta ","04 Huaros","15","04","04","Lima","Canta ","Huaros","150404","LIMA","CANTA","HUAROS","15","04","04"]
[null,"15 Lima","04 Canta ","05 Lachaqui","15","04","05","Lima","Canta ","Lachaqui","150405","LIMA","CANTA","LACHAQUI","15","04","05"]
[null,"15 Lima","04 Canta ","06 San Buenaventura","15","04","06","Lima","Canta ","San Buenaventura","150406","LIMA","CANTA","SAN BUENAVENTURA","15","04","06"]
[null,"15 Lima","04 Canta ","07 Santa Rosa de Quives","15","04","07","Lima","Canta ","Santa Rosa de Quives","150407","LIMA","CANTA","SANTA ROSA DE QUIVES","15","04","07"]
[null,"15 Lima","05 Cañete ","01 San Vicente de Cañete","15","05","01","Lima","Cañete ","San Vicente de Cañete","150501","LIMA","CAÑETE","SAN VICENTE DE CAÑETE","15","05","01"]
[null,"15 Lima","05 Cañete ","02 Asia","15","05","02","Lima","Cañete ","Asia","150502","LIMA","CAÑETE","ASIA","15","05","02"]
[null,"15 Lima","05 Cañete ","03 Calango","15","05","03","Lima","Cañete ","Calango","150503","LIMA","CAÑETE","CALANGO","15","05","03"]
[null,"15 Lima","05 Cañete ","04 Cerro Azul","15","05","04","Lima","Cañete ","Cerro Azul","150504","LIMA","CAÑETE","CERRO AZUL","15","05","04"]
[null,"15 Lima","05 Cañete ","05 Chilca",{"$f":"+MID(B1348,1,2)","v":"15"},"05","05","Lima","Cañete ","Chilca",{"$f":"+CONCATENATE(E1348,F1348,G1348)","v":"150505"},"LIMA","CAÑETE","CHILCA","15","05","05"]
[null,"15 Lima","05 Cañete ","06 Coayllo","15","05","06","Lima","Cañete ","Coayllo","150506","LIMA","CAÑETE","COAYLLO","15","05","06"]
[null,"15 Lima","05 Cañete ","07 Imperial","15","05","07","Lima","Cañete ","Imperial","150507","LIMA","CAÑETE","IMPERIAL","15","05","07"]
[null,"15 Lima","05 Cañete ","08 Lunahuana","15","05","08","Lima","Cañete ","Lunahuana","150508","LIMA","CAÑETE","LUNAHUANA","15","05","08"]
[null,"15 Lima","05 Cañete ","09 Mala","15","05","09","Lima","Cañete ","Mala","150509","LIMA","CAÑETE","MALA","15","05","09"]
[null,"15 Lima","05 Cañete ","10 Nuevo Imperial","15","05","10","Lima","Cañete ","Nuevo Imperial","150510","LIMA","CAÑETE","NUEVO IMPERIAL","15","05","10"]
[null,"15 Lima","05 Cañete ","11 Pacaran","15","05","11","Lima","Cañete ","Pacaran","150511","LIMA","CAÑETE","PACARAN","15","05","11"]
[null,"15 Lima","05 Cañete ","12 Quilmana","15","05","12","Lima","Cañete ","Quilmana","150512","LIMA","CAÑETE","QUILMANA","15","05","12"]
[null,"15 Lima","05 Cañete ","13 San Antonio","15","05","13","Lima","Cañete ","San Antonio","150513","LIMA","CAÑETE","SAN ANTONIO","15","05","13"]
[null,"15 Lima","05 Cañete ","14 San Luis","15","05","14","Lima","Cañete ","San Luis","150514","LIMA","CAÑETE","SAN LUIS","15","05","14"]
[null,"15 Lima","05 Cañete ","15 Santa Cruz de Flores","15","05","15","Lima","Cañete ","Santa Cruz de Flores","150515","LIMA","CAÑETE","SANTA CRUZ DE FLORES","15","05","15"]
[null,"15 Lima","05 Cañete ","16 Zúñiga","15","05","16","Lima","Cañete ","Zúñiga","150516","LIMA","CAÑETE","ZÚÑIGA","15","05","16"]
[null,"15 Lima","06 Huaral ","01 Huaral","15","06","01","Lima","Huaral ","Huaral","150601","LIMA","HUARAL","HUARAL","15","06","01"]
[null,"15 Lima","06 Huaral ","02 Atavillos Alto","15","06","02","Lima","Huaral ","Atavillos Alto","150602","LIMA","HUARAL","ATAVILLOS ALTO","15","06","02"]
[null,"15 Lima","06 Huaral ","03 Atavillos Bajo","15","06","03","Lima","Huaral ","Atavillos Bajo","150603","LIMA","HUARAL","ATAVILLOS BAJO","15","06","03"]
[null,"15 Lima","06 Huaral ","04 Aucallama","15","06","04","Lima","Huaral ","Aucallama","150604","LIMA","HUARAL","AUCALLAMA","15","06","04"]
[null,"15 Lima","06 Huaral ","05 Chancay","15","06","05","Lima","Huaral ","Chancay","150605","LIMA","HUARAL","CHANCAY","15","06","05"]
[null,"15 Lima","06 Huaral ","06 Ihuari","15","06","06","Lima","Huaral ","Ihuari","150606","LIMA","HUARAL","IHUARI","15","06","06"]
[null,"15 Lima","06 Huaral ","07 Lampian","15","06","07","Lima","Huaral ","Lampian","150607","LIMA","HUARAL","LAMPIAN","15","06","07"]
[null,"15 Lima","06 Huaral ","08 Pacaraos","15","06","08","Lima","Huaral ","Pacaraos","150608","LIMA","HUARAL","PACARAOS","15","06","08"]
[null,"15 Lima","06 Huaral ","09 San Miguel de Acos","15","06","09","Lima","Huaral ","San Miguel de Acos","150609","LIMA","HUARAL","SAN MIGUEL DE ACOS","15","06","09"]
[null,"15 Lima","06 Huaral ","10 Santa Cruz de Andamarca","15","06","10","Lima","Huaral ","Santa Cruz de Andamarca","150610","LIMA","HUARAL","SANTA CRUZ DE ANDAMARCA","15","06","10"]
[null,"15 Lima","06 Huaral ","11 Sumbilca","15","06","11","Lima","Huaral ","Sumbilca","150611","LIMA","HUARAL","SUMBILCA","15","06","11"]
[null,"15 Lima","06 Huaral ","12 Veintisiete de Noviembre","15","06","12","Lima","Huaral ","Veintisiete de Noviembre","150612","LIMA","HUARAL","VEINTISIETE DE NOVIEMBRE","15","06","12"]
[null,"15 Lima","07 Huarochirí ","01 Matucana","15","07","01","Lima","Huarochirí ","Matucana","150701","LIMA","HUAROCHIRÍ","MATUCANA","15","07","01"]
[null,"15 Lima","07 Huarochirí ","02 Antioquia","15","07","02","Lima","Huarochirí ","Antioquia","150702","LIMA","HUAROCHIRÍ","ANTIOQUIA","15","07","02"]
[null,"15 Lima","07 Huarochirí ","03 Callahuanca","15","07","03","Lima","Huarochirí ","Callahuanca","150703","LIMA","HUAROCHIRÍ","CALLAHUANCA","15","07","03"]
[null,"15 Lima","07 Huarochirí ","04 Carampoma","15","07","04","Lima","Huarochirí ","Carampoma","150704","LIMA","HUAROCHIRÍ","CARAMPOMA","15","07","04"]
[null,"15 Lima","07 Huarochirí ","05 Chicla","15","07","05","Lima","Huarochirí ","Chicla","150705","LIMA","HUAROCHIRÍ","CHICLA","15","07","05"]
[null,"15 Lima","07 Huarochirí ","06 Cuenca","15","07","06","Lima","Huarochirí ","Cuenca","150706","LIMA","HUAROCHIRÍ","CUENCA","15","07","06"]
[null,"15 Lima","07 Huarochirí ","07 Huachupampa","15","07","07","Lima","Huarochirí ","Huachupampa","150707","LIMA","HUAROCHIRÍ","HUACHUPAMPA","15","07","07"]
[null,"15 Lima","07 Huarochirí ","08 Huanza","15","07","08","Lima","Huarochirí ","Huanza","150708","LIMA","HUAROCHIRÍ","HUANZA","15","07","08"]
[null,"15 Lima","07 Huarochirí ","09 Huarochiri","15","07","09","Lima","Huarochirí ","Huarochiri","150709","LIMA","HUAROCHIRÍ","HUAROCHIRI","15","07","09"]
[null,"15 Lima","07 Huarochirí ","10 Lahuaytambo","15","07","10","Lima","Huarochirí ","Lahuaytambo","150710","LIMA","HUAROCHIRÍ","LAHUAYTAMBO","15","07","10"]
[null,"15 Lima","07 Huarochirí ","11 Langa","15","07","11","Lima","Huarochirí ","Langa","150711","LIMA","HUAROCHIRÍ","LANGA","15","07","11"]
[null,"15 Lima","07 Huarochirí ","12 Laraos","15","07","12","Lima","Huarochirí ","Laraos","150712","LIMA","HUAROCHIRÍ","LARAOS","15","07","12"]
[null,"15 Lima","07 Huarochirí ","13 Mariatana","15","07","13","Lima","Huarochirí ","Mariatana","150713","LIMA","HUAROCHIRÍ","MARIATANA","15","07","13"]
[null,"15 Lima","07 Huarochirí ","14 Ricardo Palma","15","07","14","Lima","Huarochirí ","Ricardo Palma","150714","LIMA","HUAROCHIRÍ","RICARDO PALMA","15","07","14"]
[null,"15 Lima","07 Huarochirí ","15 San Andrés de Tupicocha","15","07","15","Lima","Huarochirí ","San Andrés de Tupicocha","150715","LIMA","HUAROCHIRÍ","SAN ANDRÉS DE TUPICOCHA","15","07","15"]
[null,"15 Lima","07 Huarochirí ","16 San Antonio","15","07","16","Lima","Huarochirí ","San Antonio","150716","LIMA","HUAROCHIRÍ","SAN ANTONIO","15","07","16"]
[null,"15 Lima","07 Huarochirí ","17 San Bartolomé","15","07","17","Lima","Huarochirí ","San Bartolomé","150717","LIMA","HUAROCHIRÍ","SAN BARTOLOMÉ","15","07","17"]
[null,"15 Lima","07 Huarochirí ","18 San Damian","15","07","18","Lima","Huarochirí ","San Damian","150718","LIMA","HUAROCHIRÍ","SAN DAMIAN","15","07","18"]
[null,"15 Lima","07 Huarochirí ","19 San Juan de Iris","15","07","19","Lima","Huarochirí ","San Juan de Iris","150719","LIMA","HUAROCHIRÍ","SAN JUAN DE IRIS","15","07","19"]
[null,"15 Lima","07 Huarochirí ","20 San Juan de Tantaranche","15","07","20","Lima","Huarochirí ","San Juan de Tantaranche","150720","LIMA","HUAROCHIRÍ","SAN JUAN DE TANTARANCHE","15","07","20"]
[null,"15 Lima","07 Huarochirí ","21 San Lorenzo de Quinti","15","07","21","Lima","Huarochirí ","San Lorenzo de Quinti","150721","LIMA","HUAROCHIRÍ","SAN LORENZO DE QUINTI","15","07","21"]
[null,"15 Lima","07 Huarochirí ","22 San Mateo","15","07","22","Lima","Huarochirí ","San Mateo","150722","LIMA","HUAROCHIRÍ","SAN MATEO","15","07","22"]
[null,"15 Lima","07 Huarochirí ","23 San Mateo de Otao","15","07","23","Lima","Huarochirí ","San Mateo de Otao","150723","LIMA","HUAROCHIRÍ","SAN MATEO DE OTAO","15","07","23"]
[null,"15 Lima","07 Huarochirí ","24 San Pedro de Casta","15","07","24","Lima","Huarochirí ","San Pedro de Casta","150724","LIMA","HUAROCHIRÍ","SAN PEDRO DE CASTA","15","07","24"]
[null,"15 Lima","07 Huarochirí ","25 San Pedro de Huancayre","15","07","25","Lima","Huarochirí ","San Pedro de Huancayre","150725","LIMA","HUAROCHIRÍ","SAN PEDRO DE HUANCAYRE","15","07","25"]
[null,"15 Lima","07 Huarochirí ","26 Sangallaya","15","07","26","Lima","Huarochirí ","Sangallaya","150726","LIMA","HUAROCHIRÍ","SANGALLAYA","15","07","26"]
[null,"15 Lima","07 Huarochirí ","27 Santa Cruz de Cocachacra","15","07","27","Lima","Huarochirí ","Santa Cruz de Cocachacra","150727","LIMA","HUAROCHIRÍ","SANTA CRUZ DE COCACHACRA","15","07","27"]
[null,"15 Lima","07 Huarochirí ","28 Santa Eulalia","15","07","28","Lima","Huarochirí ","Santa Eulalia","150728","LIMA","HUAROCHIRÍ","SANTA EULALIA","15","07","28"]
[null,"15 Lima","07 Huarochirí ","29 Santiago de Anchucaya","15","07","29","Lima","Huarochirí ","Santiago de Anchucaya","150729","LIMA","HUAROCHIRÍ","SANTIAGO DE ANCHUCAYA","15","07","29"]
[null,"15 Lima","07 Huarochirí ","30 Santiago de Tuna","15","07","30","Lima","Huarochirí ","Santiago de Tuna","150730","LIMA","HUAROCHIRÍ","SANTIAGO DE TUNA","15","07","30"]
[null,"15 Lima","07 Huarochirí ","31 Santo Domingo de Los Olleros","15","07","31","Lima","Huarochirí ","Santo Domingo de Los Olleros","150731","LIMA","HUAROCHIRÍ","SANTO DOMINGO DE LOS OLLEROS","15","07","31"]
[null,"15 Lima","07 Huarochirí ","32 Surco","15","07","32","Lima","Huarochirí ","Surco","150732","LIMA","HUAROCHIRÍ","SURCO","15","07","32"]
[null,"15 Lima","08 Huaura ","01 Huacho","15","08","01","Lima","Huaura ","Huacho","150801","LIMA","HUAURA","HUACHO","15","08","01"]
[null,"15 Lima","08 Huaura ","02 Ambar","15","08","02","Lima","Huaura ","Ambar","150802","LIMA","HUAURA","AMBAR","15","08","02"]
[null,"15 Lima","08 Huaura ","03 Caleta de Carquin","15","08","03","Lima","Huaura ","Caleta de Carquin","150803","LIMA","HUAURA","CALETA DE CARQUIN","15","08","03"]
[null,"15 Lima","08 Huaura ","04 Checras","15","08","04","Lima","Huaura ","Checras","150804","LIMA","HUAURA","CHECRAS","15","08","04"]
[null,"15 Lima","08 Huaura ","05 Hualmay","15","08","05","Lima","Huaura ","Hualmay","150805","LIMA","HUAURA","HUALMAY","15","08","05"]
[null,"15 Lima","08 Huaura ","06 Huaura","15","08","06","Lima","Huaura ","Huaura","150806","LIMA","HUAURA","HUAURA","15","08","06"]
[null,"15 Lima","08 Huaura ","07 Leoncio Prado","15","08","07","Lima","Huaura ","Leoncio Prado","150807","LIMA","HUAURA","LEONCIO PRADO","15","08","07"]
[null,"15 Lima","08 Huaura ","08 Paccho","15","08","08","Lima","Huaura ","Paccho","150808","LIMA","HUAURA","PACCHO","15","08","08"]
[null,"15 Lima","08 Huaura ","09 Santa Leonor",{"$f":"+MID(B1412,1,2)","v":"15"},"08","09","Lima","Huaura ","Santa Leonor",{"$f":"+CONCATENATE(E1412,F1412,G1412)","v":"150809"},"LIMA","HUAURA","SANTA LEONOR","15","08","09"]
[null,"15 Lima","08 Huaura ","10 Santa María","15","08","10","Lima","Huaura ","Santa María","150810","LIMA","HUAURA","SANTA MARÍA","15","08","10"]
[null,"15 Lima","08 Huaura ","11 Sayan","15","08","11","Lima","Huaura ","Sayan","150811","LIMA","HUAURA","SAYAN","15","08","11"]
[null,"15 Lima","08 Huaura ","12 Vegueta","15","08","12","Lima","Huaura ","Vegueta","150812","LIMA","HUAURA","VEGUETA","15","08","12"]
[null,"15 Lima","09 Oyón ","01 Oyon","15","09","01","Lima","Oyón ","Oyon","150901","LIMA","OYÓN","OYON","15","09","01"]
[null,"15 Lima","09 Oyón ","02 Andajes","15","09","02","Lima","Oyón ","Andajes","150902","LIMA","OYÓN","ANDAJES","15","09","02"]
[null,"15 Lima","09 Oyón ","03 Caujul","15","09","03","Lima","Oyón ","Caujul","150903","LIMA","OYÓN","CAUJUL","15","09","03"]
[null,"15 Lima","09 Oyón ","04 Cochamarca","15","09","04","Lima","Oyón ","Cochamarca","150904","LIMA","OYÓN","COCHAMARCA","15","09","04"]
[null,"15 Lima","09 Oyón ","05 Navan","15","09","05","Lima","Oyón ","Navan","150905","LIMA","OYÓN","NAVAN","15","09","05"]
[null,"15 Lima","09 Oyón ","06 Pachangara","15","09","06","Lima","Oyón ","Pachangara","150906","LIMA","OYÓN","PACHANGARA","15","09","06"]
[null,"15 Lima","10 Yauyos ","01 Yauyos","15","10","01","Lima","Yauyos ","Yauyos","151001","LIMA","YAUYOS","YAUYOS","15","10","01"]
[null,"15 Lima","10 Yauyos ","02 Alis","15","10","02","Lima","Yauyos ","Alis","151002","LIMA","YAUYOS","ALIS","15","10","02"]
[null,"15 Lima","10 Yauyos ","03 Allauca","15","10","03","Lima","Yauyos ","Allauca","151003","LIMA","YAUYOS","ALLAUCA","15","10","03"]
[null,"15 Lima","10 Yauyos ","04 Ayaviri","15","10","04","Lima","Yauyos ","Ayaviri","151004","LIMA","YAUYOS","AYAVIRI","15","10","04"]
[null,"15 Lima","10 Yauyos ","05 Azángaro","15","10","05","Lima","Yauyos ","Azángaro","151005","LIMA","YAUYOS","AZÁNGARO","15","10","05"]
[null,"15 Lima","10 Yauyos ","06 Cacra","15","10","06","Lima","Yauyos ","Cacra","151006","LIMA","YAUYOS","CACRA","15","10","06"]
[null,"15 Lima","10 Yauyos ","07 Carania","15","10","07","Lima","Yauyos ","Carania","151007","LIMA","YAUYOS","CARANIA","15","10","07"]
[null,"15 Lima","10 Yauyos ","08 Catahuasi","15","10","08","Lima","Yauyos ","Catahuasi","151008","LIMA","YAUYOS","CATAHUASI","15","10","08"]
[null,"15 Lima","10 Yauyos ","09 Chocos","15","10","09","Lima","Yauyos ","Chocos","151009","LIMA","YAUYOS","CHOCOS","15","10","09"]
[null,"15 Lima","10 Yauyos ","10 Cochas","15","10","10","Lima","Yauyos ","Cochas","151010","LIMA","YAUYOS","COCHAS","15","10","10"]
[null,"15 Lima","10 Yauyos ","11 Colonia","15","10","11","Lima","Yauyos ","Colonia","151011","LIMA","YAUYOS","COLONIA","15","10","11"]
[null,"15 Lima","10 Yauyos ","12 Hongos","15","10","12","Lima","Yauyos ","Hongos","151012","LIMA","YAUYOS","HONGOS","15","10","12"]
[null,"15 Lima","10 Yauyos ","13 Huampara","15","10","13","Lima","Yauyos ","Huampara","151013","LIMA","YAUYOS","HUAMPARA","15","10","13"]
[null,"15 Lima","10 Yauyos ","14 Huancaya","15","10","14","Lima","Yauyos ","Huancaya","151014","LIMA","YAUYOS","HUANCAYA","15","10","14"]
[null,"15 Lima","10 Yauyos ","15 Huangascar","15","10","15","Lima","Yauyos ","Huangascar","151015","LIMA","YAUYOS","HUANGASCAR","15","10","15"]
[null,"15 Lima","10 Yauyos ","16 Huantan","15","10","16","Lima","Yauyos ","Huantan","151016","LIMA","YAUYOS","HUANTAN","15","10","16"]
[null,"15 Lima","10 Yauyos ","17 Huañec","15","10","17","Lima","Yauyos ","Huañec","151017","LIMA","YAUYOS","HUAÑEC","15","10","17"]
[null,"15 Lima","10 Yauyos ","18 Laraos","15","10","18","Lima","Yauyos ","Laraos","151018","LIMA","YAUYOS","LARAOS","15","10","18"]
[null,"15 Lima","10 Yauyos ","19 Lincha","15","10","19","Lima","Yauyos ","Lincha","151019","LIMA","YAUYOS","LINCHA","15","10","19"]
[null,"15 Lima","10 Yauyos ","20 Madean","15","10","20","Lima","Yauyos ","Madean","151020","LIMA","YAUYOS","MADEAN","15","10","20"]
[null,"15 Lima","10 Yauyos ","21 Miraflores","15","10","21","Lima","Yauyos ","Miraflores","151021","LIMA","YAUYOS","MIRAFLORES","15","10","21"]
[null,"15 Lima","10 Yauyos ","22 Omas","15","10","22","Lima","Yauyos ","Omas","151022","LIMA","YAUYOS","OMAS","15","10","22"]
[null,"15 Lima","10 Yauyos ","23 Putinza","15","10","23","Lima","Yauyos ","Putinza","151023","LIMA","YAUYOS","PUTINZA","15","10","23"]
[null,"15 Lima","10 Yauyos ","24 Quinches","15","10","24","Lima","Yauyos ","Quinches","151024","LIMA","YAUYOS","QUINCHES","15","10","24"]
[null,"15 Lima","10 Yauyos ","25 Quinocay","15","10","25","Lima","Yauyos ","Quinocay","151025","LIMA","YAUYOS","QUINOCAY","15","10","25"]
[null,"15 Lima","10 Yauyos ","26 San Joaquín","15","10","26","Lima","Yauyos ","San Joaquín","151026","LIMA","YAUYOS","SAN JOAQUÍN","15","10","26"]
[null,"15 Lima","10 Yauyos ","27 San Pedro de Pilas","15","10","27","Lima","Yauyos ","San Pedro de Pilas","151027","LIMA","YAUYOS","SAN PEDRO DE PILAS","15","10","27"]
[null,"15 Lima","10 Yauyos ","28 Tanta","15","10","28","Lima","Yauyos ","Tanta","151028","LIMA","YAUYOS","TANTA","15","10","28"]
[null,"15 Lima","10 Yauyos ","29 Tauripampa","15","10","29","Lima","Yauyos ","Tauripampa","151029","LIMA","YAUYOS","TAURIPAMPA","15","10","29"]
[null,"15 Lima","10 Yauyos ","30 Tomas","15","10","30","Lima","Yauyos ","Tomas","151030","LIMA","YAUYOS","TOMAS","15","10","30"]
[null,"15 Lima","10 Yauyos ","31 Tupe","15","10","31","Lima","Yauyos ","Tupe","151031","LIMA","YAUYOS","TUPE","15","10","31"]
[null,"15 Lima","10 Yauyos ","32 Viñac","15","10","32","Lima","Yauyos ","Viñac","151032","LIMA","YAUYOS","VIÑAC","15","10","32"]
[null,"15 Lima","10 Yauyos ","33 Vitis","15","10","33","Lima","Yauyos ","Vitis","151033","LIMA","YAUYOS","VITIS","15","10","33"]
[null,"16 Loreto","01 Maynas ","01 Iquitos","16","01","01","Loreto","Maynas ","Iquitos","160101","LORETO","MAYNAS","IQUITOS","16","01","01"]
[null,"16 Loreto","01 Maynas ","02 Alto Nanay","16","01","02","Loreto","Maynas ","Alto Nanay","160102","LORETO","MAYNAS","ALTO NANAY","16","01","02"]
[null,"16 Loreto","01 Maynas ","03 Fernando Lores","16","01","03","Loreto","Maynas ","Fernando Lores","160103","LORETO","MAYNAS","FERNANDO LORES","16","01","03"]
[null,"16 Loreto","01 Maynas ","04 Indiana","16","01","04","Loreto","Maynas ","Indiana","160104","LORETO","MAYNAS","INDIANA","16","01","04"]
[null,"16 Loreto","01 Maynas ","05 Las Amazonas","16","01","05","Loreto","Maynas ","Las Amazonas","160105","LORETO","MAYNAS","LAS AMAZONAS","16","01","05"]
[null,"16 Loreto","01 Maynas ","06 Mazan","16","01","06","Loreto","Maynas ","Mazan","160106","LORETO","MAYNAS","MAZAN","16","01","06"]
[null,"16 Loreto","01 Maynas ","07 Napo","16","01","07","Loreto","Maynas ","Napo","160107","LORETO","MAYNAS","NAPO","16","01","07"]
[null,"16 Loreto","01 Maynas ","08 Punchana","16","01","08","Loreto","Maynas ","Punchana","160108","LORETO","MAYNAS","PUNCHANA","16","01","08"]
[null,"16 Loreto","01 Maynas ","10 Torres Causana","16","01","10","Loreto","Maynas ","Torres Causana","160110","LORETO","MAYNAS","TORRES CAUSANA","16","01","10"]
[null,"16 Loreto","01 Maynas ","12 Belén","16","01","12","Loreto","Maynas ","Belén","160112","LORETO","MAYNAS","BELÉN","16","01","12"]
[null,"16 Loreto","01 Maynas ","13 San Juan Bautista","16","01","13","Loreto","Maynas ","San Juan Bautista","160113","LORETO","MAYNAS","SAN JUAN BAUTISTA","16","01","13"]
[null,"16 Loreto","02 Alto Amazonas ","01 Yurimaguas","16","02","01","Loreto","Alto Amazonas ","Yurimaguas","160201","LORETO","ALTO AMAZONAS","YURIMAGUAS","16","02","01"]
[null,"16 Loreto","02 Alto Amazonas ","02 Balsapuerto","16","02","02","Loreto","Alto Amazonas ","Balsapuerto","160202","LORETO","ALTO AMAZONAS","BALSAPUERTO","16","02","02"]
[null,"16 Loreto","02 Alto Amazonas ","05 Jeberos","16","02","05","Loreto","Alto Amazonas ","Jeberos","160205","LORETO","ALTO AMAZONAS","JEBEROS","16","02","05"]
[null,"16 Loreto","02 Alto Amazonas ","06 Lagunas","16","02","06","Loreto","Alto Amazonas ","Lagunas","160206","LORETO","ALTO AMAZONAS","LAGUNAS","16","02","06"]
[null,"16 Loreto","02 Alto Amazonas ","10 Santa Cruz","16","02","10","Loreto","Alto Amazonas ","Santa Cruz","160210","LORETO","ALTO AMAZONAS","SANTA CRUZ","16","02","10"]
[null,"16 Loreto","02 Alto Amazonas ","11 Teniente Cesar López Rojas","16","02","11","Loreto","Alto Amazonas ","Teniente Cesar López Rojas","160211","LORETO","ALTO AMAZONAS","TENIENTE CESAR LÓPEZ ROJAS","16","02","11"]
[null,"16 Loreto","03 Loreto ","01 Nauta","16","03","01","Loreto","Loreto ","Nauta","160301","LORETO","LORETO","NAUTA","16","03","01"]
[null,"16 Loreto","03 Loreto ","02 Parinari","16","03","02","Loreto","Loreto ","Parinari","160302","LORETO","LORETO","PARINARI","16","03","02"]
[null,"16 Loreto","03 Loreto ","03 Tigre","16","03","03","Loreto","Loreto ","Tigre","160303","LORETO","LORETO","TIGRE","16","03","03"]
[null,"16 Loreto","03 Loreto ","04 Trompeteros","16","03","04","Loreto","Loreto ","Trompeteros","160304","LORETO","LORETO","TROMPETEROS","16","03","04"]
[null,"16 Loreto","03 Loreto ","05 Urarinas",{"$f":"+MID(B1476,1,2)","v":"16"},"03","05","Loreto","Loreto ","Urarinas",{"$f":"+CONCATENATE(E1476,F1476,G1476)","v":"160305"},"LORETO","LORETO","URARINAS","16","03","05"]
[null,"16 Loreto","04 Mariscal Ramón Castilla ","01 Ramón Castilla","16","04","01","Loreto","Mariscal Ramón Castilla ","Ramón Castilla","160401","LORETO","MARISCAL RAMÓN CASTILLA","RAMÓN CASTILLA","16","04","01"]
[null,"16 Loreto","04 Mariscal Ramón Castilla ","02 Pebas","16","04","02","Loreto","Mariscal Ramón Castilla ","Pebas","160402","LORETO","MARISCAL RAMÓN CASTILLA","PEBAS","16","04","02"]
[null,"16 Loreto","04 Mariscal Ramón Castilla ","03 Yavari","16","04","03","Loreto","Mariscal Ramón Castilla ","Yavari","160403","LORETO","MARISCAL RAMÓN CASTILLA","YAVARI","16","04","03"]
[null,"16 Loreto","04 Mariscal Ramón Castilla ","04 San Pablo","16","04","04","Loreto","Mariscal Ramón Castilla ","San Pablo","160404","LORETO","MARISCAL RAMÓN CASTILLA","SAN PABLO","16","04","04"]
[null,"16 Loreto","05 Requena ","01 Requena","16","05","01","Loreto","Requena ","Requena","160501","LORETO","REQUENA","REQUENA","16","05","01"]
[null,"16 Loreto","05 Requena ","02 Alto Tapiche","16","05","02","Loreto","Requena ","Alto Tapiche","160502","LORETO","REQUENA","ALTO TAPICHE","16","05","02"]
[null,"16 Loreto","05 Requena ","03 Capelo","16","05","03","Loreto","Requena ","Capelo","160503","LORETO","REQUENA","CAPELO","16","05","03"]
[null,"16 Loreto","05 Requena ","04 Emilio San Martín","16","05","04","Loreto","Requena ","Emilio San Martín","160504","LORETO","REQUENA","EMILIO SAN MARTÍN","16","05","04"]
[null,"16 Loreto","05 Requena ","05 Maquia","16","05","05","Loreto","Requena ","Maquia","160505","LORETO","REQUENA","MAQUIA","16","05","05"]
[null,"16 Loreto","05 Requena ","06 Puinahua","16","05","06","Loreto","Requena ","Puinahua","160506","LORETO","REQUENA","PUINAHUA","16","05","06"]
[null,"16 Loreto","05 Requena ","07 Saquena","16","05","07","Loreto","Requena ","Saquena","160507","LORETO","REQUENA","SAQUENA","16","05","07"]
[null,"16 Loreto","05 Requena ","08 Soplin","16","05","08","Loreto","Requena ","Soplin","160508","LORETO","REQUENA","SOPLIN","16","05","08"]
[null,"16 Loreto","05 Requena ","09 Tapiche","16","05","09","Loreto","Requena ","Tapiche","160509","LORETO","REQUENA","TAPICHE","16","05","09"]
[null,"16 Loreto","05 Requena ","10 Jenaro Herrera","16","05","10","Loreto","Requena ","Jenaro Herrera","160510","LORETO","REQUENA","JENARO HERRERA","16","05","10"]
[null,"16 Loreto","05 Requena ","11 Yaquerana","16","05","11","Loreto","Requena ","Yaquerana","160511","LORETO","REQUENA","YAQUERANA","16","05","11"]
[null,"16 Loreto","06 Ucayali ","01 Contamana","16","06","01","Loreto","Ucayali ","Contamana","160601","LORETO","UCAYALI","CONTAMANA","16","06","01"]
[null,"16 Loreto","06 Ucayali ","02 Inahuaya","16","06","02","Loreto","Ucayali ","Inahuaya","160602","LORETO","UCAYALI","INAHUAYA","16","06","02"]
[null,"16 Loreto","06 Ucayali ","03 Padre Márquez","16","06","03","Loreto","Ucayali ","Padre Márquez","160603","LORETO","UCAYALI","PADRE MÁRQUEZ","16","06","03"]
[null,"16 Loreto","06 Ucayali ","04 Pampa Hermosa","16","06","04","Loreto","Ucayali ","Pampa Hermosa","160604","LORETO","UCAYALI","PAMPA HERMOSA","16","06","04"]
[null,"16 Loreto","06 Ucayali ","05 Sarayacu","16","06","05","Loreto","Ucayali ","Sarayacu","160605","LORETO","UCAYALI","SARAYACU","16","06","05"]
[null,"16 Loreto","06 Ucayali ","06 Vargas Guerra","16","06","06","Loreto","Ucayali ","Vargas Guerra","160606","LORETO","UCAYALI","VARGAS GUERRA","16","06","06"]
[null,"16 Loreto","07 Datem del Marañón ","01 Barranca","16","07","01","Loreto","Datem del Marañón ","Barranca","160701","LORETO","DATEM DEL MARAÑÓN","BARRANCA","16","07","01"]
[null,"16 Loreto","07 Datem del Marañón ","02 Cahuapanas","16","07","02","Loreto","Datem del Marañón ","Cahuapanas","160702","LORETO","DATEM DEL MARAÑÓN","CAHUAPANAS","16","07","02"]
[null,"16 Loreto","07 Datem del Marañón ","03 Manseriche","16","07","03","Loreto","Datem del Marañón ","Manseriche","160703","LORETO","DATEM DEL MARAÑÓN","MANSERICHE","16","07","03"]
[null,"16 Loreto","07 Datem del Marañón ","04 Morona","16","07","04","Loreto","Datem del Marañón ","Morona","160704","LORETO","DATEM DEL MARAÑÓN","MORONA","16","07","04"]
[null,"16 Loreto","07 Datem del Marañón ","05 Pastaza","16","07","05","Loreto","Datem del Marañón ","Pastaza","160705","LORETO","DATEM DEL MARAÑÓN","PASTAZA","16","07","05"]
[null,"16 Loreto","07 Datem del Marañón ","06 Andoas","16","07","06","Loreto","Datem del Marañón ","Andoas","160706","LORETO","DATEM DEL MARAÑÓN","ANDOAS","16","07","06"]
[null,"16 Loreto","08 Putumayo","01 Putumayo","16","08","01","Loreto","Putumayo","Putumayo","160801","LORETO","PUTUMAYO","PUTUMAYO","16","08","01"]
[null,"16 Loreto","08 Putumayo","02 Rosa Panduro","16","08","02","Loreto","Putumayo","Rosa Panduro","160802","LORETO","PUTUMAYO","ROSA PANDURO","16","08","02"]
[null,"16 Loreto","08 Putumayo","03 Teniente Manuel Clavero","16","08","03","Loreto","Putumayo","Teniente Manuel Clavero","160803","LORETO","PUTUMAYO","TENIENTE MANUEL CLAVERO","16","08","03"]
[null,"16 Loreto","08 Putumayo","04 Yaguas","16","08","04","Loreto","Putumayo","Yaguas","160804","LORETO","PUTUMAYO","YAGUAS","16","08","04"]
[null,"17 Madre de Dios","01 Tambopata ","01 Tambopata","17","01","01","Madre de Dios","Tambopata ","Tambopata","170101","MADRE DE DIOS","TAMBOPATA","TAMBOPATA","17","01","01"]
[null,"17 Madre de Dios","01 Tambopata ","02 Inambari","17","01","02","Madre de Dios","Tambopata ","Inambari","170102","MADRE DE DIOS","TAMBOPATA","INAMBARI","17","01","02"]
[null,"17 Madre de Dios","01 Tambopata ","03 Las Piedras","17","01","03","Madre de Dios","Tambopata ","Las Piedras","170103","MADRE DE DIOS","TAMBOPATA","LAS PIEDRAS","17","01","03"]
[null,"17 Madre de Dios","01 Tambopata ","04 Laberinto","17","01","04","Madre de Dios","Tambopata ","Laberinto","170104","MADRE DE DIOS","TAMBOPATA","LABERINTO","17","01","04"]
[null,"17 Madre de Dios","02 Manu ","01 Manu","17","02","01","Madre de Dios","Manu ","Manu","170201","MADRE DE DIOS","MANU","MANU","17","02","01"]
[null,"17 Madre de Dios","02 Manu ","02 Fitzcarrald","17","02","02","Madre de Dios","Manu ","Fitzcarrald","170202","MADRE DE DIOS","MANU","FITZCARRALD","17","02","02"]
[null,"17 Madre de Dios","02 Manu ","03 Madre de Dios","17","02","03","Madre de Dios","Manu ","Madre de Dios","170203","MADRE DE DIOS","MANU","MADRE DE DIOS","17","02","03"]
[null,"17 Madre de Dios","02 Manu ","04 Huepetuhe","17","02","04","Madre de Dios","Manu ","Huepetuhe","170204","MADRE DE DIOS","MANU","HUEPETUHE","17","02","04"]
[null,"17 Madre de Dios","03 Tahuamanu ","01 Iñapari","17","03","01","Madre de Dios","Tahuamanu ","Iñapari","170301","MADRE DE DIOS","TAHUAMANU","IÑAPARI","17","03","01"]
[null,"17 Madre de Dios","03 Tahuamanu ","02 Iberia","17","03","02","Madre de Dios","Tahuamanu ","Iberia","170302","MADRE DE DIOS","TAHUAMANU","IBERIA","17","03","02"]
[null,"17 Madre de Dios","03 Tahuamanu ","03 Tahuamanu","17","03","03","Madre de Dios","Tahuamanu ","Tahuamanu","170303","MADRE DE DIOS","TAHUAMANU","TAHUAMANU","17","03","03"]
[null,"18 Moquegua","01 Mariscal Nieto ","01 Moquegua","18","01","01","Moquegua","Mariscal Nieto ","Moquegua","180101","MOQUEGUA","MARISCAL NIETO","MOQUEGUA","18","01","01"]
[null,"18 Moquegua","01 Mariscal Nieto ","02 Carumas","18","01","02","Moquegua","Mariscal Nieto ","Carumas","180102","MOQUEGUA","MARISCAL NIETO","CARUMAS","18","01","02"]
[null,"18 Moquegua","01 Mariscal Nieto ","03 Cuchumbaya","18","01","03","Moquegua","Mariscal Nieto ","Cuchumbaya","180103","MOQUEGUA","MARISCAL NIETO","CUCHUMBAYA","18","01","03"]
[null,"18 Moquegua","01 Mariscal Nieto ","04 Samegua","18","01","04","Moquegua","Mariscal Nieto ","Samegua","180104","MOQUEGUA","MARISCAL NIETO","SAMEGUA","18","01","04"]
[null,"18 Moquegua","01 Mariscal Nieto ","05 San Cristóbal","18","01","05","Moquegua","Mariscal Nieto ","San Cristóbal","180105","MOQUEGUA","MARISCAL NIETO","SAN CRISTÓBAL","18","01","05"]
[null,"18 Moquegua","01 Mariscal Nieto ","06 Torata","18","01","06","Moquegua","Mariscal Nieto ","Torata","180106","MOQUEGUA","MARISCAL NIETO","TORATA","18","01","06"]
[null,"18 Moquegua","02 General Sánchez Cerro ","01 Omate","18","02","01","Moquegua","General Sánchez Cerro ","Omate","180201","MOQUEGUA","GENERAL SÁNCHEZ CERRO","OMATE","18","02","01"]
[null,"18 Moquegua","02 General Sánchez Cerro ","02 Chojata","18","02","02","Moquegua","General Sánchez Cerro ","Chojata","180202","MOQUEGUA","GENERAL SÁNCHEZ CERRO","CHOJATA","18","02","02"]
[null,"18 Moquegua","02 General Sánchez Cerro ","03 Coalaque","18","02","03","Moquegua","General Sánchez Cerro ","Coalaque","180203","MOQUEGUA","GENERAL SÁNCHEZ CERRO","COALAQUE","18","02","03"]
[null,"18 Moquegua","02 General Sánchez Cerro ","04 Ichuña","18","02","04","Moquegua","General Sánchez Cerro ","Ichuña","180204","MOQUEGUA","GENERAL SÁNCHEZ CERRO","ICHUÑA","18","02","04"]
[null,"18 Moquegua","02 General Sánchez Cerro ","05 La Capilla","18","02","05","Moquegua","General Sánchez Cerro ","La Capilla","180205","MOQUEGUA","GENERAL SÁNCHEZ CERRO","LA CAPILLA","18","02","05"]
[null,"18 Moquegua","02 General Sánchez Cerro ","06 Lloque","18","02","06","Moquegua","General Sánchez Cerro ","Lloque","180206","MOQUEGUA","GENERAL SÁNCHEZ CERRO","LLOQUE","18","02","06"]
[null,"18 Moquegua","02 General Sánchez Cerro ","07 Matalaque","18","02","07","Moquegua","General Sánchez Cerro ","Matalaque","180207","MOQUEGUA","GENERAL SÁNCHEZ CERRO","MATALAQUE","18","02","07"]
[null,"18 Moquegua","02 General Sánchez Cerro ","08 Puquina","18","02","08","Moquegua","General Sánchez Cerro ","Puquina","180208","MOQUEGUA","GENERAL SÁNCHEZ CERRO","PUQUINA","18","02","08"]
[null,"18 Moquegua","02 General Sánchez Cerro ","09 Quinistaquillas","18","02","09","Moquegua","General Sánchez Cerro ","Quinistaquillas","180209","MOQUEGUA","GENERAL SÁNCHEZ CERRO","QUINISTAQUILLAS","18","02","09"]
[null,"18 Moquegua","02 General Sánchez Cerro ","10 Ubinas","18","02","10","Moquegua","General Sánchez Cerro ","Ubinas","180210","MOQUEGUA","GENERAL SÁNCHEZ CERRO","UBINAS","18","02","10"]
[null,"18 Moquegua","02 General Sánchez Cerro ","11 Yunga","18","02","11","Moquegua","General Sánchez Cerro ","Yunga","180211","MOQUEGUA","GENERAL SÁNCHEZ CERRO","YUNGA","18","02","11"]
[null,"18 Moquegua","03 Ilo ","01 Ilo","18","03","01","Moquegua","Ilo ","Ilo","180301","MOQUEGUA","ILO","ILO","18","03","01"]
[null,"18 Moquegua","03 Ilo ","02 El Algarrobal","18","03","02","Moquegua","Ilo ","El Algarrobal","180302","MOQUEGUA","ILO","EL ALGARROBAL","18","03","02"]
[null,"18 Moquegua","03 Ilo ","03 Pacocha","18","03","03","Moquegua","Ilo ","Pacocha","180303","MOQUEGUA","ILO","PACOCHA","18","03","03"]
[null,"19 Pasco","01 Pasco ","01 Chaupimarca","19","01","01","Pasco","Pasco ","Chaupimarca","190101","PASCO","PASCO","CHAUPIMARCA","19","01","01"]
[null,"19 Pasco","01 Pasco ","02 Huachon",{"$f":"+MID(B1540,1,2)","v":"19"},"01","02","Pasco","Pasco ","Huachon",{"$f":"+CONCATENATE(E1540,F1540,G1540)","v":"190102"},"PASCO","PASCO","HUACHON","19","01","02"]
[null,"19 Pasco","01 Pasco ","03 Huariaca","19","01","03","Pasco","Pasco ","Huariaca","190103","PASCO","PASCO","HUARIACA","19","01","03"]
[null,"19 Pasco","01 Pasco ","04 Huayllay","19","01","04","Pasco","Pasco ","Huayllay","190104","PASCO","PASCO","HUAYLLAY","19","01","04"]
[null,"19 Pasco","01 Pasco ","05 Ninacaca","19","01","05","Pasco","Pasco ","Ninacaca","190105","PASCO","PASCO","NINACACA","19","01","05"]
[null,"19 Pasco","01 Pasco ","06 Pallanchacra","19","01","06","Pasco","Pasco ","Pallanchacra","190106","PASCO","PASCO","PALLANCHACRA","19","01","06"]
[null,"19 Pasco","01 Pasco ","07 Paucartambo","19","01","07","Pasco","Pasco ","Paucartambo","190107","PASCO","PASCO","PAUCARTAMBO","19","01","07"]
[null,"19 Pasco","01 Pasco ","08 San Francisco de Asís de Yarusyacan","19","01","08","Pasco","Pasco ","San Francisco de Asís de Yarus","190108","PASCO","PASCO","SAN FRANCISCO DE ASÍS DE YARUS","19","01","08"]
[null,"19 Pasco","01 Pasco ","09 Simon Bolívar","19","01","09","Pasco","Pasco ","Simon Bolívar","190109","PASCO","PASCO","SIMON BOLÍVAR","19","01","09"]
[null,"19 Pasco","01 Pasco ","10 Ticlacayan","19","01","10","Pasco","Pasco ","Ticlacayan","190110","PASCO","PASCO","TICLACAYAN","19","01","10"]
[null,"19 Pasco","01 Pasco ","11 Tinyahuarco","19","01","11","Pasco","Pasco ","Tinyahuarco","190111","PASCO","PASCO","TINYAHUARCO","19","01","11"]
[null,"19 Pasco","01 Pasco ","12 Vicco","19","01","12","Pasco","Pasco ","Vicco","190112","PASCO","PASCO","VICCO","19","01","12"]
[null,"19 Pasco","01 Pasco ","13 Yanacancha","19","01","13","Pasco","Pasco ","Yanacancha","190113","PASCO","PASCO","YANACANCHA","19","01","13"]
[null,"19 Pasco","02 Daniel Alcides Carrión ","01 Yanahuanca","19","02","01","Pasco","Daniel Alcides Carrión ","Yanahuanca","190201","PASCO","DANIEL ALCIDES CARRIÓN","YANAHUANCA","19","02","01"]
[null,"19 Pasco","02 Daniel Alcides Carrión ","02 Chacayan","19","02","02","Pasco","Daniel Alcides Carrión ","Chacayan","190202","PASCO","DANIEL ALCIDES CARRIÓN","CHACAYAN","19","02","02"]
[null,"19 Pasco","02 Daniel Alcides Carrión ","03 Goyllarisquizga","19","02","03","Pasco","Daniel Alcides Carrión ","Goyllarisquizga","190203","PASCO","DANIEL ALCIDES CARRIÓN","GOYLLARISQUIZGA","19","02","03"]
[null,"19 Pasco","02 Daniel Alcides Carrión ","04 Paucar","19","02","04","Pasco","Daniel Alcides Carrión ","Paucar","190204","PASCO","DANIEL ALCIDES CARRIÓN","PAUCAR","19","02","04"]
[null,"19 Pasco","02 Daniel Alcides Carrión ","05 San Pedro de Pillao","19","02","05","Pasco","Daniel Alcides Carrión ","San Pedro de Pillao","190205","PASCO","DANIEL ALCIDES CARRIÓN","SAN PEDRO DE PILLAO","19","02","05"]
[null,"19 Pasco","02 Daniel Alcides Carrión ","06 Santa Ana de Tusi","19","02","06","Pasco","Daniel Alcides Carrión ","Santa Ana de Tusi","190206","PASCO","DANIEL ALCIDES CARRIÓN","SANTA ANA DE TUSI","19","02","06"]
[null,"19 Pasco","02 Daniel Alcides Carrión ","07 Tapuc","19","02","07","Pasco","Daniel Alcides Carrión ","Tapuc","190207","PASCO","DANIEL ALCIDES CARRIÓN","TAPUC","19","02","07"]
[null,"19 Pasco","02 Daniel Alcides Carrión ","08 Vilcabamba","19","02","08","Pasco","Daniel Alcides Carrión ","Vilcabamba","190208","PASCO","DANIEL ALCIDES CARRIÓN","VILCABAMBA","19","02","08"]
[null,"19 Pasco","03 Oxapampa ","01 Oxapampa","19","03","01","Pasco","Oxapampa ","Oxapampa","190301","PASCO","OXAPAMPA","OXAPAMPA","19","03","01"]
[null,"19 Pasco","03 Oxapampa ","02 Chontabamba","19","03","02","Pasco","Oxapampa ","Chontabamba","190302","PASCO","OXAPAMPA","CHONTABAMBA","19","03","02"]
[null,"19 Pasco","03 Oxapampa ","03 Huancabamba","19","03","03","Pasco","Oxapampa ","Huancabamba","190303","PASCO","OXAPAMPA","HUANCABAMBA","19","03","03"]
[null,"19 Pasco","03 Oxapampa ","04 Palcazu","19","03","04","Pasco","Oxapampa ","Palcazu","190304","PASCO","OXAPAMPA","PALCAZU","19","03","04"]
[null,"19 Pasco","03 Oxapampa ","05 Pozuzo","19","03","05","Pasco","Oxapampa ","Pozuzo","190305","PASCO","OXAPAMPA","POZUZO","19","03","05"]
[null,"19 Pasco","03 Oxapampa ","06 Puerto Bermúdez","19","03","06","Pasco","Oxapampa ","Puerto Bermúdez","190306","PASCO","OXAPAMPA","PUERTO BERMÚDEZ","19","03","06"]
[null,"19 Pasco","03 Oxapampa ","07 Villa Rica","19","03","07","Pasco","Oxapampa ","Villa Rica","190307","PASCO","OXAPAMPA","VILLA RICA","19","03","07"]
[null,"19 Pasco","03 Oxapampa ","08 Constitución","19","03","08","Pasco","Oxapampa ","Constitución","190308","PASCO","OXAPAMPA","CONSTITUCIÓN","19","03","08"]
[null,"20 Piura","01 Piura ","01 Piura","20","01","01","Piura","Piura ","Piura","200101","PIURA","PIURA","PIURA","20","01","01"]
[null,"20 Piura","01 Piura ","04 Castilla","20","01","04","Piura","Piura ","Castilla","200104","PIURA","PIURA","CASTILLA","20","01","04"]
[null,"20 Piura","01 Piura ","05 Catacaos","20","01","05","Piura","Piura ","Catacaos","200105","PIURA","PIURA","CATACAOS","20","01","05"]
[null,"20 Piura","01 Piura ","07 Cura Mori","20","01","07","Piura","Piura ","Cura Mori","200107","PIURA","PIURA","CURA MORI","20","01","07"]
[null,"20 Piura","01 Piura ","08 El Tallan","20","01","08","Piura","Piura ","El Tallan","200108","PIURA","PIURA","EL TALLAN","20","01","08"]
[null,"20 Piura","01 Piura ","09 La Arena","20","01","09","Piura","Piura ","La Arena","200109","PIURA","PIURA","LA ARENA","20","01","09"]
[null,"20 Piura","01 Piura ","10 La Unión","20","01","10","Piura","Piura ","La Unión","200110","PIURA","PIURA","LA UNIÓN","20","01","10"]
[null,"20 Piura","01 Piura ","11 Las Lomas","20","01","11","Piura","Piura ","Las Lomas","200111","PIURA","PIURA","LAS LOMAS","20","01","11"]
[null,"20 Piura","01 Piura ","14 Tambo Grande","20","01","14","Piura","Piura ","Tambo Grande","200114","PIURA","PIURA","TAMBO GRANDE","20","01","14"]
[null,"20 Piura","01 Piura ","15 Veintiseis de Octubre","20","01","15","Piura","Piura ","Veintiseis de Octubre","200115","PIURA","PIURA","VEINTISEIS DE OCTUBRE","20","01","15"]
[null,"20 Piura","02 Ayabaca ","01 Ayabaca","20","02","01","Piura","Ayabaca ","Ayabaca","200201","PIURA","AYABACA","AYABACA","20","02","01"]
[null,"20 Piura","02 Ayabaca ","02 Frias","20","02","02","Piura","Ayabaca ","Frias","200202","PIURA","AYABACA","FRIAS","20","02","02"]
[null,"20 Piura","02 Ayabaca ","03 Jilili","20","02","03","Piura","Ayabaca ","Jilili","200203","PIURA","AYABACA","JILILI","20","02","03"]
[null,"20 Piura","02 Ayabaca ","04 Lagunas","20","02","04","Piura","Ayabaca ","Lagunas","200204","PIURA","AYABACA","LAGUNAS","20","02","04"]
[null,"20 Piura","02 Ayabaca ","05 Montero","20","02","05","Piura","Ayabaca ","Montero","200205","PIURA","AYABACA","MONTERO","20","02","05"]
[null,"20 Piura","02 Ayabaca ","06 Pacaipampa","20","02","06","Piura","Ayabaca ","Pacaipampa","200206","PIURA","AYABACA","PACAIPAMPA","20","02","06"]
[null,"20 Piura","02 Ayabaca ","07 Paimas","20","02","07","Piura","Ayabaca ","Paimas","200207","PIURA","AYABACA","PAIMAS","20","02","07"]
[null,"20 Piura","02 Ayabaca ","08 Sapillica","20","02","08","Piura","Ayabaca ","Sapillica","200208","PIURA","AYABACA","SAPILLICA","20","02","08"]
[null,"20 Piura","02 Ayabaca ","09 Sicchez","20","02","09","Piura","Ayabaca ","Sicchez","200209","PIURA","AYABACA","SICCHEZ","20","02","09"]
[null,"20 Piura","02 Ayabaca ","10 Suyo","20","02","10","Piura","Ayabaca ","Suyo","200210","PIURA","AYABACA","SUYO","20","02","10"]
[null,"20 Piura","03 Huancabamba ","01 Huancabamba","20","03","01","Piura","Huancabamba ","Huancabamba","200301","PIURA","HUANCABAMBA","HUANCABAMBA","20","03","01"]
[null,"20 Piura","03 Huancabamba ","02 Canchaque","20","03","02","Piura","Huancabamba ","Canchaque","200302","PIURA","HUANCABAMBA","CANCHAQUE","20","03","02"]
[null,"20 Piura","03 Huancabamba ","03 El Carmen de la Frontera","20","03","03","Piura","Huancabamba ","El Carmen de la Frontera","200303","PIURA","HUANCABAMBA","EL CARMEN DE LA FRONTERA","20","03","03"]
[null,"20 Piura","03 Huancabamba ","04 Huarmaca","20","03","04","Piura","Huancabamba ","Huarmaca","200304","PIURA","HUANCABAMBA","HUARMACA","20","03","04"]
[null,"20 Piura","03 Huancabamba ","05 Lalaquiz","20","03","05","Piura","Huancabamba ","Lalaquiz","200305","PIURA","HUANCABAMBA","LALAQUIZ","20","03","05"]
[null,"20 Piura","03 Huancabamba ","06 San Miguel de El Faique","20","03","06","Piura","Huancabamba ","San Miguel de El Faique","200306","PIURA","HUANCABAMBA","SAN MIGUEL DE EL FAIQUE","20","03","06"]
[null,"20 Piura","03 Huancabamba ","07 Sondor","20","03","07","Piura","Huancabamba ","Sondor","200307","PIURA","HUANCABAMBA","SONDOR","20","03","07"]
[null,"20 Piura","03 Huancabamba ","08 Sondorillo","20","03","08","Piura","Huancabamba ","Sondorillo","200308","PIURA","HUANCABAMBA","SONDORILLO","20","03","08"]
[null,"20 Piura","04 Morropón ","01 Chulucanas","20","04","01","Piura","Morropón ","Chulucanas","200401","PIURA","MORROPÓN","CHULUCANAS","20","04","01"]
[null,"20 Piura","04 Morropón ","02 Buenos Aires","20","04","02","Piura","Morropón ","Buenos Aires","200402","PIURA","MORROPÓN","BUENOS AIRES","20","04","02"]
[null,"20 Piura","04 Morropón ","03 Chalaco","20","04","03","Piura","Morropón ","Chalaco","200403","PIURA","MORROPÓN","CHALACO","20","04","03"]
[null,"20 Piura","04 Morropón ","04 La Matanza","20","04","04","Piura","Morropón ","La Matanza","200404","PIURA","MORROPÓN","LA MATANZA","20","04","04"]
[null,"20 Piura","04 Morropón ","05 Morropon","20","04","05","Piura","Morropón ","Morropon","200405","PIURA","MORROPÓN","MORROPON","20","04","05"]
[null,"20 Piura","04 Morropón ","06 Salitral","20","04","06","Piura","Morropón ","Salitral","200406","PIURA","MORROPÓN","SALITRAL","20","04","06"]
[null,"20 Piura","04 Morropón ","07 San Juan de Bigote","20","04","07","Piura","Morropón ","San Juan de Bigote","200407","PIURA","MORROPÓN","SAN JUAN DE BIGOTE","20","04","07"]
[null,"20 Piura","04 Morropón ","08 Santa Catalina de Mossa","20","04","08","Piura","Morropón ","Santa Catalina de Mossa","200408","PIURA","MORROPÓN","SANTA CATALINA DE MOSSA","20","04","08"]
[null,"20 Piura","04 Morropón ","09 Santo Domingo",{"$f":"+MID(B1604,1,2)","v":"20"},"04","09","Piura","Morropón ","Santo Domingo",{"$f":"+CONCATENATE(E1604,F1604,G1604)","v":"200409"},"PIURA","MORROPÓN","SANTO DOMINGO","20","04","09"]
[null,"20 Piura","04 Morropón ","10 Yamango","20","04","10","Piura","Morropón ","Yamango","200410","PIURA","MORROPÓN","YAMANGO","20","04","10"]
[null,"20 Piura","05 Paita ","01 Paita","20","05","01","Piura","Paita ","Paita","200501","PIURA","PAITA","PAITA","20","05","01"]
[null,"20 Piura","05 Paita ","02 Amotape","20","05","02","Piura","Paita ","Amotape","200502","PIURA","PAITA","AMOTAPE","20","05","02"]
[null,"20 Piura","05 Paita ","03 Arenal","20","05","03","Piura","Paita ","Arenal","200503","PIURA","PAITA","ARENAL","20","05","03"]
[null,"20 Piura","05 Paita ","04 Colan","20","05","04","Piura","Paita ","Colan","200504","PIURA","PAITA","COLAN","20","05","04"]
[null,"20 Piura","05 Paita ","05 La Huaca","20","05","05","Piura","Paita ","La Huaca","200505","PIURA","PAITA","LA HUACA","20","05","05"]
[null,"20 Piura","05 Paita ","06 Tamarindo","20","05","06","Piura","Paita ","Tamarindo","200506","PIURA","PAITA","TAMARINDO","20","05","06"]
[null,"20 Piura","05 Paita ","07 Vichayal","20","05","07","Piura","Paita ","Vichayal","200507","PIURA","PAITA","VICHAYAL","20","05","07"]
[null,"20 Piura","06 Sullana ","01 Sullana","20","06","01","Piura","Sullana ","Sullana","200601","PIURA","SULLANA","SULLANA","20","06","01"]
[null,"20 Piura","06 Sullana ","02 Bellavista","20","06","02","Piura","Sullana ","Bellavista","200602","PIURA","SULLANA","BELLAVISTA","20","06","02"]
[null,"20 Piura","06 Sullana ","03 Ignacio Escudero","20","06","03","Piura","Sullana ","Ignacio Escudero","200603","PIURA","SULLANA","IGNACIO ESCUDERO","20","06","03"]
[null,"20 Piura","06 Sullana ","04 Lancones","20","06","04","Piura","Sullana ","Lancones","200604","PIURA","SULLANA","LANCONES","20","06","04"]
[null,"20 Piura","06 Sullana ","05 Marcavelica","20","06","05","Piura","Sullana ","Marcavelica","200605","PIURA","SULLANA","MARCAVELICA","20","06","05"]
[null,"20 Piura","06 Sullana ","06 Miguel Checa","20","06","06","Piura","Sullana ","Miguel Checa","200606","PIURA","SULLANA","MIGUEL CHECA","20","06","06"]
[null,"20 Piura","06 Sullana ","07 Querecotillo","20","06","07","Piura","Sullana ","Querecotillo","200607","PIURA","SULLANA","QUERECOTILLO","20","06","07"]
[null,"20 Piura","06 Sullana ","08 Salitral","20","06","08","Piura","Sullana ","Salitral","200608","PIURA","SULLANA","SALITRAL","20","06","08"]
[null,"20 Piura","07 Talara ","01 Pariñas","20","07","01","Piura","Talara ","Pariñas","200701","PIURA","TALARA","PARIÑAS","20","07","01"]
[null,"20 Piura","07 Talara ","02 El Alto","20","07","02","Piura","Talara ","El Alto","200702","PIURA","TALARA","EL ALTO","20","07","02"]
[null,"20 Piura","07 Talara ","03 La Brea","20","07","03","Piura","Talara ","La Brea","200703","PIURA","TALARA","LA BREA","20","07","03"]
[null,"20 Piura","07 Talara ","04 Lobitos","20","07","04","Piura","Talara ","Lobitos","200704","PIURA","TALARA","LOBITOS","20","07","04"]
[null,"20 Piura","07 Talara ","05 Los Organos","20","07","05","Piura","Talara ","Los Organos","200705","PIURA","TALARA","LOS ORGANOS","20","07","05"]
[null,"20 Piura","07 Talara ","06 Mancora","20","07","06","Piura","Talara ","Mancora","200706","PIURA","TALARA","MANCORA","20","07","06"]
[null,"20 Piura","08 Sechura ","01 Sechura","20","08","01","Piura","Sechura ","Sechura","200801","PIURA","SECHURA","SECHURA","20","08","01"]
[null,"20 Piura","08 Sechura ","02 Bellavista de la Unión","20","08","02","Piura","Sechura ","Bellavista de la Unión","200802","PIURA","SECHURA","BELLAVISTA DE LA UNIÓN","20","08","02"]
[null,"20 Piura","08 Sechura ","03 Bernal","20","08","03","Piura","Sechura ","Bernal","200803","PIURA","SECHURA","BERNAL","20","08","03"]
[null,"20 Piura","08 Sechura ","04 Cristo Nos Valga","20","08","04","Piura","Sechura ","Cristo Nos Valga","200804","PIURA","SECHURA","CRISTO NOS VALGA","20","08","04"]
[null,"20 Piura","08 Sechura ","05 Vice","20","08","05","Piura","Sechura ","Vice","200805","PIURA","SECHURA","VICE","20","08","05"]
[null,"20 Piura","08 Sechura ","06 Rinconada Llicuar","20","08","06","Piura","Sechura ","Rinconada Llicuar","200806","PIURA","SECHURA","RINCONADA LLICUAR","20","08","06"]
[null,"21 Puno","01 Puno ","01 Puno","21","01","01","Puno","Puno ","Puno","210101","PUNO","PUNO","PUNO","21","01","01"]
[null,"21 Puno","01 Puno ","02 Acora","21","01","02","Puno","Puno ","Acora","210102","PUNO","PUNO","ACORA","21","01","02"]
[null,"21 Puno","01 Puno ","03 Amantani","21","01","03","Puno","Puno ","Amantani","210103","PUNO","PUNO","AMANTANI","21","01","03"]
[null,"21 Puno","01 Puno ","04 Atuncolla","21","01","04","Puno","Puno ","Atuncolla","210104","PUNO","PUNO","ATUNCOLLA","21","01","04"]
[null,"21 Puno","01 Puno ","05 Capachica","21","01","05","Puno","Puno ","Capachica","210105","PUNO","PUNO","CAPACHICA","21","01","05"]
[null,"21 Puno","01 Puno ","06 Chucuito","21","01","06","Puno","Puno ","Chucuito","210106","PUNO","PUNO","CHUCUITO","21","01","06"]
[null,"21 Puno","01 Puno ","07 Coata","21","01","07","Puno","Puno ","Coata","210107","PUNO","PUNO","COATA","21","01","07"]
[null,"21 Puno","01 Puno ","08 Huata","21","01","08","Puno","Puno ","Huata","210108","PUNO","PUNO","HUATA","21","01","08"]
[null,"21 Puno","01 Puno ","09 Mañazo","21","01","09","Puno","Puno ","Mañazo","210109","PUNO","PUNO","MAÑAZO","21","01","09"]
[null,"21 Puno","01 Puno ","10 Paucarcolla","21","01","10","Puno","Puno ","Paucarcolla","210110","PUNO","PUNO","PAUCARCOLLA","21","01","10"]
[null,"21 Puno","01 Puno ","11 Pichacani","21","01","11","Puno","Puno ","Pichacani","210111","PUNO","PUNO","PICHACANI","21","01","11"]
[null,"21 Puno","01 Puno ","12 Plateria","21","01","12","Puno","Puno ","Plateria","210112","PUNO","PUNO","PLATERIA","21","01","12"]
[null,"21 Puno","01 Puno ","13 San Antonio","21","01","13","Puno","Puno ","San Antonio","210113","PUNO","PUNO","SAN ANTONIO","21","01","13"]
[null,"21 Puno","01 Puno ","14 Tiquillaca","21","01","14","Puno","Puno ","Tiquillaca","210114","PUNO","PUNO","TIQUILLACA","21","01","14"]
[null,"21 Puno","01 Puno ","15 Vilque","21","01","15","Puno","Puno ","Vilque","210115","PUNO","PUNO","VILQUE","21","01","15"]
[null,"21 Puno","02 Azángaro ","01 Azángaro","21","02","01","Puno","Azángaro ","Azángaro","210201","PUNO","AZÁNGARO","AZÁNGARO","21","02","01"]
[null,"21 Puno","02 Azángaro ","02 Achaya","21","02","02","Puno","Azángaro ","Achaya","210202","PUNO","AZÁNGARO","ACHAYA","21","02","02"]
[null,"21 Puno","02 Azángaro ","03 Arapa","21","02","03","Puno","Azángaro ","Arapa","210203","PUNO","AZÁNGARO","ARAPA","21","02","03"]
[null,"21 Puno","02 Azángaro ","04 Asillo","21","02","04","Puno","Azángaro ","Asillo","210204","PUNO","AZÁNGARO","ASILLO","21","02","04"]
[null,"21 Puno","02 Azángaro ","05 Caminaca","21","02","05","Puno","Azángaro ","Caminaca","210205","PUNO","AZÁNGARO","CAMINACA","21","02","05"]
[null,"21 Puno","02 Azángaro ","06 Chupa","21","02","06","Puno","Azángaro ","Chupa","210206","PUNO","AZÁNGARO","CHUPA","21","02","06"]
[null,"21 Puno","02 Azángaro ","07 José Domingo Choquehuanca","21","02","07","Puno","Azángaro ","José Domingo Choquehuanca","210207","PUNO","AZÁNGARO","JOSÉ DOMINGO CHOQUEHUANCA","21","02","07"]
[null,"21 Puno","02 Azángaro ","08 Muñani","21","02","08","Puno","Azángaro ","Muñani","210208","PUNO","AZÁNGARO","MUÑANI","21","02","08"]
[null,"21 Puno","02 Azángaro ","09 Potoni","21","02","09","Puno","Azángaro ","Potoni","210209","PUNO","AZÁNGARO","POTONI","21","02","09"]
[null,"21 Puno","02 Azángaro ","10 Saman","21","02","10","Puno","Azángaro ","Saman","210210","PUNO","AZÁNGARO","SAMAN","21","02","10"]
[null,"21 Puno","02 Azángaro ","11 San Anton","21","02","11","Puno","Azángaro ","San Anton","210211","PUNO","AZÁNGARO","SAN ANTON","21","02","11"]
[null,"21 Puno","02 Azángaro ","12 San José","21","02","12","Puno","Azángaro ","San José","210212","PUNO","AZÁNGARO","SAN JOSÉ","21","02","12"]
[null,"21 Puno","02 Azángaro ","13 San Juan de Salinas","21","02","13","Puno","Azángaro ","San Juan de Salinas","210213","PUNO","AZÁNGARO","SAN JUAN DE SALINAS","21","02","13"]
[null,"21 Puno","02 Azángaro ","14 Santiago de Pupuja","21","02","14","Puno","Azángaro ","Santiago de Pupuja","210214","PUNO","AZÁNGARO","SANTIAGO DE PUPUJA","21","02","14"]
[null,"21 Puno","02 Azángaro ","15 Tirapata","21","02","15","Puno","Azángaro ","Tirapata","210215","PUNO","AZÁNGARO","TIRAPATA","21","02","15"]
[null,"21 Puno","03 Carabaya ","01 Macusani","21","03","01","Puno","Carabaya ","Macusani","210301","PUNO","CARABAYA","MACUSANI","21","03","01"]
[null,"21 Puno","03 Carabaya ","02 Ajoyani","21","03","02","Puno","Carabaya ","Ajoyani","210302","PUNO","CARABAYA","AJOYANI","21","03","02"]
[null,"21 Puno","03 Carabaya ","03 Ayapata","21","03","03","Puno","Carabaya ","Ayapata","210303","PUNO","CARABAYA","AYAPATA","21","03","03"]
[null,"21 Puno","03 Carabaya ","04 Coasa","21","03","04","Puno","Carabaya ","Coasa","210304","PUNO","CARABAYA","COASA","21","03","04"]
[null,"21 Puno","03 Carabaya ","05 Corani","21","03","05","Puno","Carabaya ","Corani","210305","PUNO","CARABAYA","CORANI","21","03","05"]
[null,"21 Puno","03 Carabaya ","06 Crucero",{"$f":"+MID(B1668,1,2)","v":"21"},"03","06","Puno","Carabaya ","Crucero",{"$f":"+CONCATENATE(E1668,F1668,G1668)","v":"210306"},"PUNO","CARABAYA","CRUCERO","21","03","06"]
[null,"21 Puno","03 Carabaya ","07 Ituata","21","03","07","Puno","Carabaya ","Ituata","210307","PUNO","CARABAYA","ITUATA","21","03","07"]
[null,"21 Puno","03 Carabaya ","08 Ollachea","21","03","08","Puno","Carabaya ","Ollachea","210308","PUNO","CARABAYA","OLLACHEA","21","03","08"]
[null,"21 Puno","03 Carabaya ","09 San Gaban","21","03","09","Puno","Carabaya ","San Gaban","210309","PUNO","CARABAYA","SAN GABAN","21","03","09"]
[null,"21 Puno","03 Carabaya ","10 Usicayos","21","03","10","Puno","Carabaya ","Usicayos","210310","PUNO","CARABAYA","USICAYOS","21","03","10"]
[null,"21 Puno","04 Chucuito ","01 Juli","21","04","01","Puno","Chucuito ","Juli","210401","PUNO","CHUCUITO","JULI","21","04","01"]
[null,"21 Puno","04 Chucuito ","02 Desaguadero","21","04","02","Puno","Chucuito ","Desaguadero","210402","PUNO","CHUCUITO","DESAGUADERO","21","04","02"]
[null,"21 Puno","04 Chucuito ","03 Huacullani","21","04","03","Puno","Chucuito ","Huacullani","210403","PUNO","CHUCUITO","HUACULLANI","21","04","03"]
[null,"21 Puno","04 Chucuito ","04 Kelluyo","21","04","04","Puno","Chucuito ","Kelluyo","210404","PUNO","CHUCUITO","KELLUYO","21","04","04"]
[null,"21 Puno","04 Chucuito ","05 Pisacoma","21","04","05","Puno","Chucuito ","Pisacoma","210405","PUNO","CHUCUITO","PISACOMA","21","04","05"]
[null,"21 Puno","04 Chucuito ","06 Pomata","21","04","06","Puno","Chucuito ","Pomata","210406","PUNO","CHUCUITO","POMATA","21","04","06"]
[null,"21 Puno","04 Chucuito ","07 Zepita","21","04","07","Puno","Chucuito ","Zepita","210407","PUNO","CHUCUITO","ZEPITA","21","04","07"]
[null,"21 Puno","05 El Collao ","01 Ilave","21","05","01","Puno","El Collao ","Ilave","210501","PUNO","EL COLLAO","ILAVE","21","05","01"]
[null,"21 Puno","05 El Collao ","02 Capazo","21","05","02","Puno","El Collao ","Capazo","210502","PUNO","EL COLLAO","CAPAZO","21","05","02"]
[null,"21 Puno","05 El Collao ","03 Pilcuyo","21","05","03","Puno","El Collao ","Pilcuyo","210503","PUNO","EL COLLAO","PILCUYO","21","05","03"]
[null,"21 Puno","05 El Collao ","04 Santa Rosa","21","05","04","Puno","El Collao ","Santa Rosa","210504","PUNO","EL COLLAO","SANTA ROSA","21","05","04"]
[null,"21 Puno","05 El Collao ","05 Conduriri","21","05","05","Puno","El Collao ","Conduriri","210505","PUNO","EL COLLAO","CONDURIRI","21","05","05"]
[null,"21 Puno","06 Huancané ","01 Huancane","21","06","01","Puno","Huancané ","Huancane","210601","PUNO","HUANCANÉ","HUANCANE","21","06","01"]
[null,"21 Puno","06 Huancané ","02 Cojata","21","06","02","Puno","Huancané ","Cojata","210602","PUNO","HUANCANÉ","COJATA","21","06","02"]
[null,"21 Puno","06 Huancané ","03 Huatasani","21","06","03","Puno","Huancané ","Huatasani","210603","PUNO","HUANCANÉ","HUATASANI","21","06","03"]
[null,"21 Puno","06 Huancané ","04 Inchupalla","21","06","04","Puno","Huancané ","Inchupalla","210604","PUNO","HUANCANÉ","INCHUPALLA","21","06","04"]
[null,"21 Puno","06 Huancané ","05 Pusi","21","06","05","Puno","Huancané ","Pusi","210605","PUNO","HUANCANÉ","PUSI","21","06","05"]
[null,"21 Puno","06 Huancané ","06 Rosaspata","21","06","06","Puno","Huancané ","Rosaspata","210606","PUNO","HUANCANÉ","ROSASPATA","21","06","06"]
[null,"21 Puno","06 Huancané ","07 Taraco","21","06","07","Puno","Huancané ","Taraco","210607","PUNO","HUANCANÉ","TARACO","21","06","07"]
[null,"21 Puno","06 Huancané ","08 Vilque Chico","21","06","08","Puno","Huancané ","Vilque Chico","210608","PUNO","HUANCANÉ","VILQUE CHICO","21","06","08"]
[null,"21 Puno","07 Lampa ","01 Lampa","21","07","01","Puno","Lampa ","Lampa","210701","PUNO","LAMPA","LAMPA","21","07","01"]
[null,"21 Puno","07 Lampa ","02 Cabanilla","21","07","02","Puno","Lampa ","Cabanilla","210702","PUNO","LAMPA","CABANILLA","21","07","02"]
[null,"21 Puno","07 Lampa ","03 Calapuja","21","07","03","Puno","Lampa ","Calapuja","210703","PUNO","LAMPA","CALAPUJA","21","07","03"]
[null,"21 Puno","07 Lampa ","04 Nicasio","21","07","04","Puno","Lampa ","Nicasio","210704","PUNO","LAMPA","NICASIO","21","07","04"]
[null,"21 Puno","07 Lampa ","05 Ocuviri","21","07","05","Puno","Lampa ","Ocuviri","210705","PUNO","LAMPA","OCUVIRI","21","07","05"]
[null,"21 Puno","07 Lampa ","06 Palca","21","07","06","Puno","Lampa ","Palca","210706","PUNO","LAMPA","PALCA","21","07","06"]
[null,"21 Puno","07 Lampa ","07 Paratia","21","07","07","Puno","Lampa ","Paratia","210707","PUNO","LAMPA","PARATIA","21","07","07"]
[null,"21 Puno","07 Lampa ","08 Pucara","21","07","08","Puno","Lampa ","Pucara","210708","PUNO","LAMPA","PUCARA","21","07","08"]
[null,"21 Puno","07 Lampa ","09 Santa Lucia","21","07","09","Puno","Lampa ","Santa Lucia","210709","PUNO","LAMPA","SANTA LUCIA","21","07","09"]
[null,"21 Puno","07 Lampa ","10 Vilavila","21","07","10","Puno","Lampa ","Vilavila","210710","PUNO","LAMPA","VILAVILA","21","07","10"]
[null,"21 Puno","08 Melgar ","01 Ayaviri","21","08","01","Puno","Melgar ","Ayaviri","210801","PUNO","MELGAR","AYAVIRI","21","08","01"]
[null,"21 Puno","08 Melgar ","02 Antauta","21","08","02","Puno","Melgar ","Antauta","210802","PUNO","MELGAR","ANTAUTA","21","08","02"]
[null,"21 Puno","08 Melgar ","03 Cupi","21","08","03","Puno","Melgar ","Cupi","210803","PUNO","MELGAR","CUPI","21","08","03"]
[null,"21 Puno","08 Melgar ","04 Llalli","21","08","04","Puno","Melgar ","Llalli","210804","PUNO","MELGAR","LLALLI","21","08","04"]
[null,"21 Puno","08 Melgar ","05 Macari","21","08","05","Puno","Melgar ","Macari","210805","PUNO","MELGAR","MACARI","21","08","05"]
[null,"21 Puno","08 Melgar ","06 Nuñoa","21","08","06","Puno","Melgar ","Nuñoa","210806","PUNO","MELGAR","NUÑOA","21","08","06"]
[null,"21 Puno","08 Melgar ","07 Orurillo","21","08","07","Puno","Melgar ","Orurillo","210807","PUNO","MELGAR","ORURILLO","21","08","07"]
[null,"21 Puno","08 Melgar ","08 Santa Rosa","21","08","08","Puno","Melgar ","Santa Rosa","210808","PUNO","MELGAR","SANTA ROSA","21","08","08"]
[null,"21 Puno","08 Melgar ","09 Umachiri","21","08","09","Puno","Melgar ","Umachiri","210809","PUNO","MELGAR","UMACHIRI","21","08","09"]
[null,"21 Puno","09 Moho ","01 Moho","21","09","01","Puno","Moho ","Moho","210901","PUNO","MOHO","MOHO","21","09","01"]
[null,"21 Puno","09 Moho ","02 Conima","21","09","02","Puno","Moho ","Conima","210902","PUNO","MOHO","CONIMA","21","09","02"]
[null,"21 Puno","09 Moho ","03 Huayrapata","21","09","03","Puno","Moho ","Huayrapata","210903","PUNO","MOHO","HUAYRAPATA","21","09","03"]
[null,"21 Puno","09 Moho ","04 Tilali","21","09","04","Puno","Moho ","Tilali","210904","PUNO","MOHO","TILALI","21","09","04"]
[null,"21 Puno","10 San Antonio de Putina ","01 Putina","21","10","01","Puno","San Antonio de Putina ","Putina","211001","PUNO","SAN ANTONIO DE PUTINA","PUTINA","21","10","01"]
[null,"21 Puno","10 San Antonio de Putina ","02 Ananea","21","10","02","Puno","San Antonio de Putina ","Ananea","211002","PUNO","SAN ANTONIO DE PUTINA","ANANEA","21","10","02"]
[null,"21 Puno","10 San Antonio de Putina ","03 Pedro Vilca Apaza","21","10","03","Puno","San Antonio de Putina ","Pedro Vilca Apaza","211003","PUNO","SAN ANTONIO DE PUTINA","PEDRO VILCA APAZA","21","10","03"]
[null,"21 Puno","10 San Antonio de Putina ","04 Quilcapuncu","21","10","04","Puno","San Antonio de Putina ","Quilcapuncu","211004","PUNO","SAN ANTONIO DE PUTINA","QUILCAPUNCU","21","10","04"]
[null,"21 Puno","10 San Antonio de Putina ","05 Sina","21","10","05","Puno","San Antonio de Putina ","Sina","211005","PUNO","SAN ANTONIO DE PUTINA","SINA","21","10","05"]
[null,"21 Puno","11 San Román ","01 Juliaca","21","11","01","Puno","San Román ","Juliaca","211101","PUNO","SAN ROMÁN","JULIACA","21","11","01"]
[null,"21 Puno","11 San Román ","02 Cabana","21","11","02","Puno","San Román ","Cabana","211102","PUNO","SAN ROMÁN","CABANA","21","11","02"]
[null,"21 Puno","11 San Román ","03 Cabanillas","21","11","03","Puno","San Román ","Cabanillas","211103","PUNO","SAN ROMÁN","CABANILLAS","21","11","03"]
[null,"21 Puno","11 San Román ","04 Caracoto","21","11","04","Puno","San Román ","Caracoto","211104","PUNO","SAN ROMÁN","CARACOTO","21","11","04"]
[null,"21 Puno","11 San Román ","05 San Miguel","21","11","05","Puno","San Román ","San Miguel","211105","PUNO","SAN ROMÁN","SAN MIGUEL","21","11","05"]
[null,"21 Puno","12 Sandia ","01 Sandia","21","12","01","Puno","Sandia ","Sandia","211201","PUNO","SANDIA","SANDIA","21","12","01"]
[null,"21 Puno","12 Sandia ","02 Cuyocuyo","21","12","02","Puno","Sandia ","Cuyocuyo","211202","PUNO","SANDIA","CUYOCUYO","21","12","02"]
[null,"21 Puno","12 Sandia ","03 Limbani","21","12","03","Puno","Sandia ","Limbani","211203","PUNO","SANDIA","LIMBANI","21","12","03"]
[null,"21 Puno","12 Sandia ","04 Patambuco","21","12","04","Puno","Sandia ","Patambuco","211204","PUNO","SANDIA","PATAMBUCO","21","12","04"]
[null,"21 Puno","12 Sandia ","05 Phara","21","12","05","Puno","Sandia ","Phara","211205","PUNO","SANDIA","PHARA","21","12","05"]
[null,"21 Puno","12 Sandia ","06 Quiaca","21","12","06","Puno","Sandia ","Quiaca","211206","PUNO","SANDIA","QUIACA","21","12","06"]
[null,"21 Puno","12 Sandia ","07 San Juan del Oro",{"$f":"+MID(B1732,1,2)","v":"21"},"12","07","Puno","Sandia ","San Juan del Oro",{"$f":"+CONCATENATE(E1732,F1732,G1732)","v":"211207"},"PUNO","SANDIA","SAN JUAN DEL ORO","21","12","07"]
[null,"21 Puno","12 Sandia ","08 Yanahuaya","21","12","08","Puno","Sandia ","Yanahuaya","211208","PUNO","SANDIA","YANAHUAYA","21","12","08"]
[null,"21 Puno","12 Sandia ","09 Alto Inambari","21","12","09","Puno","Sandia ","Alto Inambari","211209","PUNO","SANDIA","ALTO INAMBARI","21","12","09"]
[null,"21 Puno","12 Sandia ","10 San Pedro de Putina Punco","21","12","10","Puno","Sandia ","San Pedro de Putina Punco","211210","PUNO","SANDIA","SAN PEDRO DE PUTINA PUNCO","21","12","10"]
[null,"21 Puno","13 Yunguyo ","01 Yunguyo","21","13","01","Puno","Yunguyo ","Yunguyo","211301","PUNO","YUNGUYO","YUNGUYO","21","13","01"]
[null,"21 Puno","13 Yunguyo ","02 Anapia","21","13","02","Puno","Yunguyo ","Anapia","211302","PUNO","YUNGUYO","ANAPIA","21","13","02"]
[null,"21 Puno","13 Yunguyo ","03 Copani","21","13","03","Puno","Yunguyo ","Copani","211303","PUNO","YUNGUYO","COPANI","21","13","03"]
[null,"21 Puno","13 Yunguyo ","04 Cuturapi","21","13","04","Puno","Yunguyo ","Cuturapi","211304","PUNO","YUNGUYO","CUTURAPI","21","13","04"]
[null,"21 Puno","13 Yunguyo ","05 Ollaraya","21","13","05","Puno","Yunguyo ","Ollaraya","211305","PUNO","YUNGUYO","OLLARAYA","21","13","05"]
[null,"21 Puno","13 Yunguyo ","06 Tinicachi","21","13","06","Puno","Yunguyo ","Tinicachi","211306","PUNO","YUNGUYO","TINICACHI","21","13","06"]
[null,"21 Puno","13 Yunguyo ","07 Unicachi","21","13","07","Puno","Yunguyo ","Unicachi","211307","PUNO","YUNGUYO","UNICACHI","21","13","07"]
[null,"22 San Martín","01 Moyobamba ","01 Moyobamba","22","01","01","San Martín","Moyobamba ","Moyobamba","220101","SAN MARTÍN","MOYOBAMBA","MOYOBAMBA","22","01","01"]
[null,"22 San Martín","01 Moyobamba ","02 Calzada","22","01","02","San Martín","Moyobamba ","Calzada","220102","SAN MARTÍN","MOYOBAMBA","CALZADA","22","01","02"]
[null,"22 San Martín","01 Moyobamba ","03 Habana","22","01","03","San Martín","Moyobamba ","Habana","220103","SAN MARTÍN","MOYOBAMBA","HABANA","22","01","03"]
[null,"22 San Martín","01 Moyobamba ","04 Jepelacio","22","01","04","San Martín","Moyobamba ","Jepelacio","220104","SAN MARTÍN","MOYOBAMBA","JEPELACIO","22","01","04"]
[null,"22 San Martín","01 Moyobamba ","05 Soritor","22","01","05","San Martín","Moyobamba ","Soritor","220105","SAN MARTÍN","MOYOBAMBA","SORITOR","22","01","05"]
[null,"22 San Martín","01 Moyobamba ","06 Yantalo","22","01","06","San Martín","Moyobamba ","Yantalo","220106","SAN MARTÍN","MOYOBAMBA","YANTALO","22","01","06"]
[null,"22 San Martín","02 Bellavista ","01 Bellavista","22","02","01","San Martín","Bellavista ","Bellavista","220201","SAN MARTÍN","BELLAVISTA","BELLAVISTA","22","02","01"]
[null,"22 San Martín","02 Bellavista ","02 Alto Biavo","22","02","02","San Martín","Bellavista ","Alto Biavo","220202","SAN MARTÍN","BELLAVISTA","ALTO BIAVO","22","02","02"]
[null,"22 San Martín","02 Bellavista ","03 Bajo Biavo","22","02","03","San Martín","Bellavista ","Bajo Biavo","220203","SAN MARTÍN","BELLAVISTA","BAJO BIAVO","22","02","03"]
[null,"22 San Martín","02 Bellavista ","04 Huallaga","22","02","04","San Martín","Bellavista ","Huallaga","220204","SAN MARTÍN","BELLAVISTA","HUALLAGA","22","02","04"]
[null,"22 San Martín","02 Bellavista ","05 San Pablo","22","02","05","San Martín","Bellavista ","San Pablo","220205","SAN MARTÍN","BELLAVISTA","SAN PABLO","22","02","05"]
[null,"22 San Martín","02 Bellavista ","06 San Rafael","22","02","06","San Martín","Bellavista ","San Rafael","220206","SAN MARTÍN","BELLAVISTA","SAN RAFAEL","22","02","06"]
[null,"22 San Martín","03 El Dorado ","01 San José de Sisa","22","03","01","San Martín","El Dorado ","San José de Sisa","220301","SAN MARTÍN","EL DORADO","SAN JOSÉ DE SISA","22","03","01"]
[null,"22 San Martín","03 El Dorado ","02 Agua Blanca","22","03","02","San Martín","El Dorado ","Agua Blanca","220302","SAN MARTÍN","EL DORADO","AGUA BLANCA","22","03","02"]
[null,"22 San Martín","03 El Dorado ","03 San Martín","22","03","03","San Martín","El Dorado ","San Martín","220303","SAN MARTÍN","EL DORADO","SAN MARTÍN","22","03","03"]
[null,"22 San Martín","03 El Dorado ","04 Santa Rosa","22","03","04","San Martín","El Dorado ","Santa Rosa","220304","SAN MARTÍN","EL DORADO","SANTA ROSA","22","03","04"]
[null,"22 San Martín","03 El Dorado ","05 Shatoja","22","03","05","San Martín","El Dorado ","Shatoja","220305","SAN MARTÍN","EL DORADO","SHATOJA","22","03","05"]
[null,"22 San Martín","04 Huallaga ","01 Saposoa","22","04","01","San Martín","Huallaga ","Saposoa","220401","SAN MARTÍN","HUALLAGA","SAPOSOA","22","04","01"]
[null,"22 San Martín","04 Huallaga ","02 Alto Saposoa","22","04","02","San Martín","Huallaga ","Alto Saposoa","220402","SAN MARTÍN","HUALLAGA","ALTO SAPOSOA","22","04","02"]
[null,"22 San Martín","04 Huallaga ","03 El Eslabón","22","04","03","San Martín","Huallaga ","El Eslabón","220403","SAN MARTÍN","HUALLAGA","EL ESLABÓN","22","04","03"]
[null,"22 San Martín","04 Huallaga ","04 Piscoyacu","22","04","04","San Martín","Huallaga ","Piscoyacu","220404","SAN MARTÍN","HUALLAGA","PISCOYACU","22","04","04"]
[null,"22 San Martín","04 Huallaga ","05 Sacanche","22","04","05","San Martín","Huallaga ","Sacanche","220405","SAN MARTÍN","HUALLAGA","SACANCHE","22","04","05"]
[null,"22 San Martín","04 Huallaga ","06 Tingo de Saposoa","22","04","06","San Martín","Huallaga ","Tingo de Saposoa","220406","SAN MARTÍN","HUALLAGA","TINGO DE SAPOSOA","22","04","06"]
[null,"22 San Martín","05 Lamas ","01 Lamas","22","05","01","San Martín","Lamas ","Lamas","220501","SAN MARTÍN","LAMAS","LAMAS","22","05","01"]
[null,"22 San Martín","05 Lamas ","02 Alonso de Alvarado","22","05","02","San Martín","Lamas ","Alonso de Alvarado","220502","SAN MARTÍN","LAMAS","ALONSO DE ALVARADO","22","05","02"]
[null,"22 San Martín","05 Lamas ","03 Barranquita","22","05","03","San Martín","Lamas ","Barranquita","220503","SAN MARTÍN","LAMAS","BARRANQUITA","22","05","03"]
[null,"22 San Martín","05 Lamas ","04 Caynarachi","22","05","04","San Martín","Lamas ","Caynarachi","220504","SAN MARTÍN","LAMAS","CAYNARACHI","22","05","04"]
[null,"22 San Martín","05 Lamas ","05 Cuñumbuqui","22","05","05","San Martín","Lamas ","Cuñumbuqui","220505","SAN MARTÍN","LAMAS","CUÑUMBUQUI","22","05","05"]
[null,"22 San Martín","05 Lamas ","06 Pinto Recodo","22","05","06","San Martín","Lamas ","Pinto Recodo","220506","SAN MARTÍN","LAMAS","PINTO RECODO","22","05","06"]
[null,"22 San Martín","05 Lamas ","07 Rumisapa","22","05","07","San Martín","Lamas ","Rumisapa","220507","SAN MARTÍN","LAMAS","RUMISAPA","22","05","07"]
[null,"22 San Martín","05 Lamas ","08 San Roque de Cumbaza","22","05","08","San Martín","Lamas ","San Roque de Cumbaza","220508","SAN MARTÍN","LAMAS","SAN ROQUE DE CUMBAZA","22","05","08"]
[null,"22 San Martín","05 Lamas ","09 Shanao","22","05","09","San Martín","Lamas ","Shanao","220509","SAN MARTÍN","LAMAS","SHANAO","22","05","09"]
[null,"22 San Martín","05 Lamas ","10 Tabalosos","22","05","10","San Martín","Lamas ","Tabalosos","220510","SAN MARTÍN","LAMAS","TABALOSOS","22","05","10"]
[null,"22 San Martín","05 Lamas ","11 Zapatero","22","05","11","San Martín","Lamas ","Zapatero","220511","SAN MARTÍN","LAMAS","ZAPATERO","22","05","11"]
[null,"22 San Martín","06 Mariscal Cáceres ","01 Juanjuí","22","06","01","San Martín","Mariscal Cáceres ","Juanjuí","220601","SAN MARTÍN","MARISCAL CÁCERES","JUANJUÍ","22","06","01"]
[null,"22 San Martín","06 Mariscal Cáceres ","02 Campanilla","22","06","02","San Martín","Mariscal Cáceres ","Campanilla","220602","SAN MARTÍN","MARISCAL CÁCERES","CAMPANILLA","22","06","02"]
[null,"22 San Martín","06 Mariscal Cáceres ","03 Huicungo","22","06","03","San Martín","Mariscal Cáceres ","Huicungo","220603","SAN MARTÍN","MARISCAL CÁCERES","HUICUNGO","22","06","03"]
[null,"22 San Martín","06 Mariscal Cáceres ","04 Pachiza","22","06","04","San Martín","Mariscal Cáceres ","Pachiza","220604","SAN MARTÍN","MARISCAL CÁCERES","PACHIZA","22","06","04"]
[null,"22 San Martín","06 Mariscal Cáceres ","05 Pajarillo","22","06","05","San Martín","Mariscal Cáceres ","Pajarillo","220605","SAN MARTÍN","MARISCAL CÁCERES","PAJARILLO","22","06","05"]
[null,"22 San Martín","07 Picota ","01 Picota","22","07","01","San Martín","Picota ","Picota","220701","SAN MARTÍN","PICOTA","PICOTA","22","07","01"]
[null,"22 San Martín","07 Picota ","02 Buenos Aires","22","07","02","San Martín","Picota ","Buenos Aires","220702","SAN MARTÍN","PICOTA","BUENOS AIRES","22","07","02"]
[null,"22 San Martín","07 Picota ","03 Caspisapa","22","07","03","San Martín","Picota ","Caspisapa","220703","SAN MARTÍN","PICOTA","CASPISAPA","22","07","03"]
[null,"22 San Martín","07 Picota ","04 Pilluana","22","07","04","San Martín","Picota ","Pilluana","220704","SAN MARTÍN","PICOTA","PILLUANA","22","07","04"]
[null,"22 San Martín","07 Picota ","05 Pucacaca","22","07","05","San Martín","Picota ","Pucacaca","220705","SAN MARTÍN","PICOTA","PUCACACA","22","07","05"]
[null,"22 San Martín","07 Picota ","06 San Cristóbal","22","07","06","San Martín","Picota ","San Cristóbal","220706","SAN MARTÍN","PICOTA","SAN CRISTÓBAL","22","07","06"]
[null,"22 San Martín","07 Picota ","07 San Hilarión","22","07","07","San Martín","Picota ","San Hilarión","220707","SAN MARTÍN","PICOTA","SAN HILARIÓN","22","07","07"]
[null,"22 San Martín","07 Picota ","08 Shamboyacu","22","07","08","San Martín","Picota ","Shamboyacu","220708","SAN MARTÍN","PICOTA","SHAMBOYACU","22","07","08"]
[null,"22 San Martín","07 Picota ","09 Tingo de Ponasa","22","07","09","San Martín","Picota ","Tingo de Ponasa","220709","SAN MARTÍN","PICOTA","TINGO DE PONASA","22","07","09"]
[null,"22 San Martín","07 Picota ","10 Tres Unidos","22","07","10","San Martín","Picota ","Tres Unidos","220710","SAN MARTÍN","PICOTA","TRES UNIDOS","22","07","10"]
[null,"22 San Martín","08 Rioja ","01 Rioja","22","08","01","San Martín","Rioja ","Rioja","220801","SAN MARTÍN","RIOJA","RIOJA","22","08","01"]
[null,"22 San Martín","08 Rioja ","02 Awajun","22","08","02","San Martín","Rioja ","Awajun","220802","SAN MARTÍN","RIOJA","AWAJUN","22","08","02"]
[null,"22 San Martín","08 Rioja ","03 Elías Soplin Vargas","22","08","03","San Martín","Rioja ","Elías Soplin Vargas","220803","SAN MARTÍN","RIOJA","ELÍAS SOPLIN VARGAS","22","08","03"]
[null,"22 San Martín","08 Rioja ","04 Nueva Cajamarca","22","08","04","San Martín","Rioja ","Nueva Cajamarca","220804","SAN MARTÍN","RIOJA","NUEVA CAJAMARCA","22","08","04"]
[null,"22 San Martín","08 Rioja ","05 Pardo Miguel",{"$f":"+MID(B1796,1,2)","v":"22"},"08","05","San Martín","Rioja ","Pardo Miguel",{"$f":"+CONCATENATE(E1796,F1796,G1796)","v":"220805"},"SAN MARTÍN","RIOJA","PARDO MIGUEL","22","08","05"]
[null,"22 San Martín","08 Rioja ","06 Posic","22","08","06","San Martín","Rioja ","Posic","220806","SAN MARTÍN","RIOJA","POSIC","22","08","06"]
[null,"22 San Martín","08 Rioja ","07 San Fernando","22","08","07","San Martín","Rioja ","San Fernando","220807","SAN MARTÍN","RIOJA","SAN FERNANDO","22","08","07"]
[null,"22 San Martín","08 Rioja ","08 Yorongos","22","08","08","San Martín","Rioja ","Yorongos","220808","SAN MARTÍN","RIOJA","YORONGOS","22","08","08"]
[null,"22 San Martín","08 Rioja ","09 Yuracyacu","22","08","09","San Martín","Rioja ","Yuracyacu","220809","SAN MARTÍN","RIOJA","YURACYACU","22","08","09"]
[null,"22 San Martín","09 San Martín ","01 Tarapoto","22","09","01","San Martín","San Martín ","Tarapoto","220901","SAN MARTÍN","SAN MARTÍN","TARAPOTO","22","09","01"]
[null,"22 San Martín","09 San Martín ","02 Alberto Leveau","22","09","02","San Martín","San Martín ","Alberto Leveau","220902","SAN MARTÍN","SAN MARTÍN","ALBERTO LEVEAU","22","09","02"]
[null,"22 San Martín","09 San Martín ","03 Cacatachi","22","09","03","San Martín","San Martín ","Cacatachi","220903","SAN MARTÍN","SAN MARTÍN","CACATACHI","22","09","03"]
[null,"22 San Martín","09 San Martín ","04 Chazuta","22","09","04","San Martín","San Martín ","Chazuta","220904","SAN MARTÍN","SAN MARTÍN","CHAZUTA","22","09","04"]
[null,"22 San Martín","09 San Martín ","05 Chipurana","22","09","05","San Martín","San Martín ","Chipurana","220905","SAN MARTÍN","SAN MARTÍN","CHIPURANA","22","09","05"]
[null,"22 San Martín","09 San Martín ","06 El Porvenir","22","09","06","San Martín","San Martín ","El Porvenir","220906","SAN MARTÍN","SAN MARTÍN","EL PORVENIR","22","09","06"]
[null,"22 San Martín","09 San Martín ","07 Huimbayoc","22","09","07","San Martín","San Martín ","Huimbayoc","220907","SAN MARTÍN","SAN MARTÍN","HUIMBAYOC","22","09","07"]
[null,"22 San Martín","09 San Martín ","08 Juan Guerra","22","09","08","San Martín","San Martín ","Juan Guerra","220908","SAN MARTÍN","SAN MARTÍN","JUAN GUERRA","22","09","08"]
[null,"22 San Martín","09 San Martín ","09 La Banda de Shilcayo","22","09","09","San Martín","San Martín ","La Banda de Shilcayo","220909","SAN MARTÍN","SAN MARTÍN","LA BANDA DE SHILCAYO","22","09","09"]
[null,"22 San Martín","09 San Martín ","10 Morales","22","09","10","San Martín","San Martín ","Morales","220910","SAN MARTÍN","SAN MARTÍN","MORALES","22","09","10"]
[null,"22 San Martín","09 San Martín ","11 Papaplaya","22","09","11","San Martín","San Martín ","Papaplaya","220911","SAN MARTÍN","SAN MARTÍN","PAPAPLAYA","22","09","11"]
[null,"22 San Martín","09 San Martín ","12 San Antonio","22","09","12","San Martín","San Martín ","San Antonio","220912","SAN MARTÍN","SAN MARTÍN","SAN ANTONIO","22","09","12"]
[null,"22 San Martín","09 San Martín ","13 Sauce","22","09","13","San Martín","San Martín ","Sauce","220913","SAN MARTÍN","SAN MARTÍN","SAUCE","22","09","13"]
[null,"22 San Martín","09 San Martín ","14 Shapaja","22","09","14","San Martín","San Martín ","Shapaja","220914","SAN MARTÍN","SAN MARTÍN","SHAPAJA","22","09","14"]
[null,"22 San Martín","10 Tocache ","01 Tocache","22","10","01","San Martín","Tocache ","Tocache","221001","SAN MARTÍN","TOCACHE","TOCACHE","22","10","01"]
[null,"22 San Martín","10 Tocache ","02 Nuevo Progreso","22","10","02","San Martín","Tocache ","Nuevo Progreso","221002","SAN MARTÍN","TOCACHE","NUEVO PROGRESO","22","10","02"]
[null,"22 San Martín","10 Tocache ","03 Polvora","22","10","03","San Martín","Tocache ","Polvora","221003","SAN MARTÍN","TOCACHE","POLVORA","22","10","03"]
[null,"22 San Martín","10 Tocache ","04 Shunte","22","10","04","San Martín","Tocache ","Shunte","221004","SAN MARTÍN","TOCACHE","SHUNTE","22","10","04"]
[null,"22 San Martín","10 Tocache ","05 Uchiza","22","10","05","San Martín","Tocache ","Uchiza","221005","SAN MARTÍN","TOCACHE","UCHIZA","22","10","05"]
[null,"23 Tacna","01 Tacna ","01 Tacna","23","01","01","Tacna","Tacna ","Tacna","230101","TACNA","TACNA","TACNA","23","01","01"]
[null,"23 Tacna","01 Tacna ","02 Alto de la Alianza","23","01","02","Tacna","Tacna ","Alto de la Alianza","230102","TACNA","TACNA","ALTO DE LA ALIANZA","23","01","02"]
[null,"23 Tacna","01 Tacna ","03 Calana","23","01","03","Tacna","Tacna ","Calana","230103","TACNA","TACNA","CALANA","23","01","03"]
[null,"23 Tacna","01 Tacna ","04 Ciudad Nueva","23","01","04","Tacna","Tacna ","Ciudad Nueva","230104","TACNA","TACNA","CIUDAD NUEVA","23","01","04"]
[null,"23 Tacna","01 Tacna ","05 Inclan","23","01","05","Tacna","Tacna ","Inclan","230105","TACNA","TACNA","INCLAN","23","01","05"]
[null,"23 Tacna","01 Tacna ","06 Pachia","23","01","06","Tacna","Tacna ","Pachia","230106","TACNA","TACNA","PACHIA","23","01","06"]
[null,"23 Tacna","01 Tacna ","07 Palca","23","01","07","Tacna","Tacna ","Palca","230107","TACNA","TACNA","PALCA","23","01","07"]
[null,"23 Tacna","01 Tacna ","08 Pocollay","23","01","08","Tacna","Tacna ","Pocollay","230108","TACNA","TACNA","POCOLLAY","23","01","08"]
[null,"23 Tacna","01 Tacna ","09 Sama","23","01","09","Tacna","Tacna ","Sama","230109","TACNA","TACNA","SAMA","23","01","09"]
[null,"23 Tacna","01 Tacna ","10 Coronel Gregorio Albarracín Lanchipa","23","01","10","Tacna","Tacna ","Coronel Gregorio Albarracín La","230110","TACNA","TACNA","CORONEL GREGORIO ALBARRACÍN LA","23","01","10"]
[null,"23 Tacna","01 Tacna ","11 La Yarada los Palos","23","01","11","Tacna","Tacna ","La Yarada los Palos","230111","TACNA","TACNA","LA YARADA LOS PALOS","23","01","11"]
[null,"23 Tacna","02 Candarave ","01 Candarave","23","02","01","Tacna","Candarave ","Candarave","230201","TACNA","CANDARAVE","CANDARAVE","23","02","01"]
[null,"23 Tacna","02 Candarave ","02 Cairani","23","02","02","Tacna","Candarave ","Cairani","230202","TACNA","CANDARAVE","CAIRANI","23","02","02"]
[null,"23 Tacna","02 Candarave ","03 Camilaca","23","02","03","Tacna","Candarave ","Camilaca","230203","TACNA","CANDARAVE","CAMILACA","23","02","03"]
[null,"23 Tacna","02 Candarave ","04 Curibaya","23","02","04","Tacna","Candarave ","Curibaya","230204","TACNA","CANDARAVE","CURIBAYA","23","02","04"]
[null,"23 Tacna","02 Candarave ","05 Huanuara","23","02","05","Tacna","Candarave ","Huanuara","230205","TACNA","CANDARAVE","HUANUARA","23","02","05"]
[null,"23 Tacna","02 Candarave ","06 Quilahuani","23","02","06","Tacna","Candarave ","Quilahuani","230206","TACNA","CANDARAVE","QUILAHUANI","23","02","06"]
[null,"23 Tacna","03 Jorge Basadre ","01 Locumba","23","03","01","Tacna","Jorge Basadre ","Locumba","230301","TACNA","JORGE BASADRE","LOCUMBA","23","03","01"]
[null,"23 Tacna","03 Jorge Basadre ","02 Ilabaya","23","03","02","Tacna","Jorge Basadre ","Ilabaya","230302","TACNA","JORGE BASADRE","ILABAYA","23","03","02"]
[null,"23 Tacna","03 Jorge Basadre ","03 Ite","23","03","03","Tacna","Jorge Basadre ","Ite","230303","TACNA","JORGE BASADRE","ITE","23","03","03"]
[null,"23 Tacna","04 Tarata ","01 Tarata","23","04","01","Tacna","Tarata ","Tarata","230401","TACNA","TARATA","TARATA","23","04","01"]
[null,"23 Tacna","04 Tarata ","02 Héroes Albarracín","23","04","02","Tacna","Tarata ","Héroes Albarracín","230402","TACNA","TARATA","HÉROES ALBARRACÍN","23","04","02"]
[null,"23 Tacna","04 Tarata ","03 Estique","23","04","03","Tacna","Tarata ","Estique","230403","TACNA","TARATA","ESTIQUE","23","04","03"]
[null,"23 Tacna","04 Tarata ","04 Estique-Pampa","23","04","04","Tacna","Tarata ","Estique-Pampa","230404","TACNA","TARATA","ESTIQUE-PAMPA","23","04","04"]
[null,"23 Tacna","04 Tarata ","05 Sitajara","23","04","05","Tacna","Tarata ","Sitajara","230405","TACNA","TARATA","SITAJARA","23","04","05"]
[null,"23 Tacna","04 Tarata ","06 Susapaya","23","04","06","Tacna","Tarata ","Susapaya","230406","TACNA","TARATA","SUSAPAYA","23","04","06"]
[null,"23 Tacna","04 Tarata ","07 Tarucachi","23","04","07","Tacna","Tarata ","Tarucachi","230407","TACNA","TARATA","TARUCACHI","23","04","07"]
[null,"23 Tacna","04 Tarata ","08 Ticaco","23","04","08","Tacna","Tarata ","Ticaco","230408","TACNA","TARATA","TICACO","23","04","08"]
[null,"24 Tumbes","01 Tumbes ","01 Tumbes","24","01","01","Tumbes","Tumbes ","Tumbes","240101","TUMBES","TUMBES","TUMBES","24","01","01"]
[null,"24 Tumbes","01 Tumbes ","02 Corrales","24","01","02","Tumbes","Tumbes ","Corrales","240102","TUMBES","TUMBES","CORRALES","24","01","02"]
[null,"24 Tumbes","01 Tumbes ","03 La Cruz","24","01","03","Tumbes","Tumbes ","La Cruz","240103","TUMBES","TUMBES","LA CRUZ","24","01","03"]
[null,"24 Tumbes","01 Tumbes ","04 Pampas de Hospital","24","01","04","Tumbes","Tumbes ","Pampas de Hospital","240104","TUMBES","TUMBES","PAMPAS DE HOSPITAL","24","01","04"]
[null,"24 Tumbes","01 Tumbes ","05 San Jacinto","24","01","05","Tumbes","Tumbes ","San Jacinto","240105","TUMBES","TUMBES","SAN JACINTO","24","01","05"]
[null,"24 Tumbes","01 Tumbes ","06 San Juan de la Virgen","24","01","06","Tumbes","Tumbes ","San Juan de la Virgen","240106","TUMBES","TUMBES","SAN JUAN DE LA VIRGEN","24","01","06"]
[null,"24 Tumbes","02 Contralmirante Villar ","01 Zorritos","24","02","01","Tumbes","Contralmirante Villar ","Zorritos","240201","TUMBES","CONTRALMIRANTE VILLAR","ZORRITOS","24","02","01"]
[null,"24 Tumbes","02 Contralmirante Villar ","02 Casitas","24","02","02","Tumbes","Contralmirante Villar ","Casitas","240202","TUMBES","CONTRALMIRANTE VILLAR","CASITAS","24","02","02"]
[null,"24 Tumbes","02 Contralmirante Villar ","03 Canoas de Punta Sal","24","02","03","Tumbes","Contralmirante Villar ","Canoas de Punta Sal","240203","TUMBES","CONTRALMIRANTE VILLAR","CANOAS DE PUNTA SAL","24","02","03"]
[null,"24 Tumbes","03 Zarumilla ","01 Zarumilla","24","03","01","Tumbes","Zarumilla ","Zarumilla","240301","TUMBES","ZARUMILLA","ZARUMILLA","24","03","01"]
[null,"24 Tumbes","03 Zarumilla ","02 Aguas Verdes","24","03","02","Tumbes","Zarumilla ","Aguas Verdes","240302","TUMBES","ZARUMILLA","AGUAS VERDES","24","03","02"]
[null,"24 Tumbes","03 Zarumilla ","03 Matapalo","24","03","03","Tumbes","Zarumilla ","Matapalo","240303","TUMBES","ZARUMILLA","MATAPALO","24","03","03"]
[null,"24 Tumbes","03 Zarumilla ","04 Papayal",{"$f":"+MID(B1860,1,2)","v":"24"},"03","04","Tumbes","Zarumilla ","Papayal",{"$f":"+CONCATENATE(E1860,F1860,G1860)","v":"240304"},"TUMBES","ZARUMILLA","PAPAYAL","24","03","04"]
[null,"25 Ucayali","01 Coronel Portillo ","01 Calleria","25","01","01","Ucayali","Coronel Portillo ","Calleria","250101","UCAYALI","CORONEL PORTILLO","CALLERIA","25","01","01"]
[null,"25 Ucayali","01 Coronel Portillo ","02 Campoverde","25","01","02","Ucayali","Coronel Portillo ","Campoverde","250102","UCAYALI","CORONEL PORTILLO","CAMPOVERDE","25","01","02"]
[null,"25 Ucayali","01 Coronel Portillo ","03 Iparia","25","01","03","Ucayali","Coronel Portillo ","Iparia","250103","UCAYALI","CORONEL PORTILLO","IPARIA","25","01","03"]
[null,"25 Ucayali","01 Coronel Portillo ","04 Masisea","25","01","04","Ucayali","Coronel Portillo ","Masisea","250104","UCAYALI","CORONEL PORTILLO","MASISEA","25","01","04"]
[null,"25 Ucayali","01 Coronel Portillo ","05 Yarinacocha","25","01","05","Ucayali","Coronel Portillo ","Yarinacocha","250105","UCAYALI","CORONEL PORTILLO","YARINACOCHA","25","01","05"]
[null,"25 Ucayali","01 Coronel Portillo ","06 Nueva Requena","25","01","06","Ucayali","Coronel Portillo ","Nueva Requena","250106","UCAYALI","CORONEL PORTILLO","NUEVA REQUENA","25","01","06"]
[null,"25 Ucayali","01 Coronel Portillo ","07 Manantay","25","01","07","Ucayali","Coronel Portillo ","Manantay","250107","UCAYALI","CORONEL PORTILLO","MANANTAY","25","01","07"]
[null,"25 Ucayali","02 Atalaya ","01 Raymondi","25","02","01","Ucayali","Atalaya ","Raymondi","250201","UCAYALI","ATALAYA","RAYMONDI","25","02","01"]
[null,"25 Ucayali","02 Atalaya ","02 Sepahua","25","02","02","Ucayali","Atalaya ","Sepahua","250202","UCAYALI","ATALAYA","SEPAHUA","25","02","02"]
[null,"25 Ucayali","02 Atalaya ","03 Tahuania","25","02","03","Ucayali","Atalaya ","Tahuania","250203","UCAYALI","ATALAYA","TAHUANIA","25","02","03"]
[null,"25 Ucayali","02 Atalaya ","04 Yurua","25","02","04","Ucayali","Atalaya ","Yurua","250204","UCAYALI","ATALAYA","YURUA","25","02","04"]
[null,"25 Ucayali","03 Padre Abad ","01 Padre Abad","25","03","01","Ucayali","Padre Abad ","Padre Abad","250301","UCAYALI","PADRE ABAD","PADRE ABAD","25","03","01"]
[null,"25 Ucayali","03 Padre Abad ","02 Irazola","25","03","02","Ucayali","Padre Abad ","Irazola","250302","UCAYALI","PADRE ABAD","IRAZOLA","25","03","02"]
[null,"25 Ucayali","03 Padre Abad ","03 Curimana","25","03","03","Ucayali","Padre Abad ","Curimana","250303","UCAYALI","PADRE ABAD","CURIMANA","25","03","03"]
[null,"25 Ucayali","03 Padre Abad ","04 Neshuya","25","03","04","Ucayali","Padre Abad ","Neshuya","250304","UCAYALI","PADRE ABAD","NESHUYA","25","03","04"]
[null,"25 Ucayali","03 Padre Abad ","05 Alexander Von Humboldt","25","03","05","Ucayali","Padre Abad ","Alexander Von Humboldt","250305","UCAYALI","PADRE ABAD","ALEXANDER VON HUMBOLDT","25","03","05"]
[null,"25 Ucayali","04 Purús","01 Purus","25","04","01","Ucayali","Purús","Purus","250401","UCAYALI","PURÚS","PURUS","25","04","01"]

{"sheet":"Solicitud.Manual","index":6,"n_rows":148,"n_cols":12,"rows_kept":148,"cut":false,"hidden":true,"merged":[[14,8,14,9],[1,0,1,12],[5,0,5,3],[5,7,5,12],[8,2,8,4],[8,8,8,12],[9,8,9,9],[10,2,10,4],[10,8,10,12],[11,8,11,9],[12,8,12,9],[13,8,13,9],[37,2,37,3],[37,4,37,7],[28,2,28,3],[28,4,28,7],[15,8,15,9],[16,8,16,9],[17,8,17,9],[18,8,18,9],[19,8,19,9],[20,2,20,4],[20,8,20,12],[25,2,25,3],[26,2,26,3],[26,4,26,7],[27,2,27,3],[27,4,27,7],[33,2,33,3],[33,4,33,7],[35,2,35,3],[36,2,36,3],[36,4,36,7],[30,2,30,3],[31,2,31,3],[31,4,31,7],[32,2,32,3],[32,4,32,7],[46,10,46,12],[57,6,58,6],[57,7,58,7],[57,8,58,8],[38,2,38,3],[38,4,38,7],[40,0,40,1],[46,6,46,8],[64,1,64,5],[65,1,65,5],[66,1,66,5],[46,2,46,3],[101,1,104,12],[74,1,75,12],[67,1,67,5],[68,1,68,5],[69,1,69,5],[70,1,70,5],[71,1,71,5],[147,3,147,6],[147,9,147,12],[57,1,58,1],[57,2,58,2],[57,3,58,3],[106,1,106,12],[113,1,114,12],[117,1,118,12],[141,9,141,10],[143,9,143,12],[145,9,145,12],[77,1,80,12],[82,1,83,12],[85,1,88,12],[91,1,95,12],[97,1,99,12]]}
[]
["Ingreso Manual Solicitud de Seguro Multiriesgo Pyme"]
[]
[]
[]
["Datos Generales -> Informacion del Contratante",null,null,null,null,null,null,"Datos Generales -> Informacion del Asegurado"]
[null,null,null,null,null,null,null,"¿Contratante es diferente de Asegurado?","SI"]
[null,"Tipo de Documento*:",null,"Nro Documento:",null,null,null,"Tipo de Documento*:",null,null,"Nro Documento:"]
[null,"Nombre / Razón Social*:",null,null,null,null,null,"Nombre / Razón Social*:"]
[null,"Apellido Paterno:",null,"Apellido Materno:",null,null,null,"Apellido Paterno:",null,null,"Apellido Materno:"]
[null,"Direccion",null,null,null,null,null,"Direccion"]
[null,"Nro",null,"Cargo:",null,null,null,"Nro",null,null,null,"Cargo:"]
[null,"Dpto/Piso/Int",null,null,null,null,null,"Dpto/Piso/Int"]
[null,"Lt:",null,"Código de cliente:",null,null,null,"Lt:",null,null,null,"Código de cliente:"]
[null,"Mz:",null,"Profesion / Ocupación:",null,null,null,"Mz:",null,null,null,"Profesion / Ocupación:"]
[null,"Distrito:",null,"Nacionalidad:",null,null,null,"Distrito:",null,null,null,"Nacionalidad:"]
[null,"Provincia:",null,"Fecha de Nacimiento:",null,null,null,"Provincia:",null,null,null,"Fecha de Nacimiento:"]
[null,"Departamento:",null,"Estado Civil:",null,null,null,"Departamento:",null,null,null,"Estado Civil:"]
[null,"Teléfono Casa:",null,"Teléfono Trabajo:",null,null,null,"Teléfono Casa:",null,null,null,"Teléfono Trabajo:"]
[null,"Teléfono Móvil:",null,null,null,null,null,"Teléfono Móvil:"]
[null,"Correo Electrónico:",null,null,null,null,null,"Correo Electrónico:"]
[null,"¿Desea recibir información del seguro y otro?",null,null,null,null,null,"¿Desea recibir información del seguro y otro?"]
[null,"¿Desea recibir su póliza de forma electrónica?",null,null,null,null,null,"¿Desea recibir su póliza de forma electrónica?"]
["Datos del Negocio (Datos vienen de la hoja Cotizador)"]
[]
[null,null,"Local 1"]
[null,null,"Actividad y/o Giro:",null,{"$f":"IF(LEN(Cotizador!$D$54)>0,Cotizador!$D$54,\"\")","v":""}]
[null,null,"Tipo:",null,{"$f":"IF(LEN(Cotizador!$D$62)>0,Cotizador!$D$62,\"\")","v":"Comercial y Servicios"}]
[null,null,"Ocupación:",null,{"$f":"IF(LEN(Cotizador!$D$71)>0,Cotizador!$D$71,\"\")","v":""}]
[]
[null,null,"Local 2"]
[null,null,"Actividad y/o Giro:",null,{"$f":"IF(LEN(Cotizador!$D$56)>0,Cotizador!$D$56,\"\")","v":""}]
[null,null,"Tipo:",null,{"$f":"IF(LEN(Cotizador!$D$64)>0,Cotizador!$D$64,\"\")","v":"Comercial y Servicios"}]
[null,null,"Ocupación:",null,{"$f":"IF(LEN(Cotizador!$D$73)>0,Cotizador!$D$73,\"\")","v":""}]
[]
[null,null,"Local 3"]
[null,null,"Actividad y/o Giro:",null,{"$f":"IF(LEN(Cotizador!$D$58)>0,Cotizador!$D$58,\"\")","v":""}]
[null,null,"Tipo:",null,{"$f":"IF(LEN(Cotizador!$D$66)>0,Cotizador!$D$66,\"\")","v":"Comercial y Servicios"}]
[null,null,"Ocupación:",null,{"$f":"IF(LEN(Cotizador!$D$75)>0,Cotizador!$D$75,\"\")","v":""}]
[]
["Declaración Jurada"]
[]
[null,null,"Local 1",null,null,null,"Local 2",null,null,null,"Local 3"]
[null,"Departamento",{"$f":"IF(LEN(Cotizador!$I$53)>0,Cotizador!$I$53,\"\")","v":""},null,null,null,{"$f":"IF(LEN(Cotizador!$M$53)>0,Cotizador!$M$53,\"\")","v":""},null,null,null,{"$f":"IF(LEN(Cotizador!$Q$53)>0,Cotizador!$Q$53,\"\")","v":""}]
[null,"Provincia",{"$f":"IF(LEN(Cotizador!$I$54)>0,Cotizador!$I$54,\"\")","v":""},null,null,null,{"$f":"IF(LEN(Cotizador!$M$54)>0,Cotizador!$M$54,\"\")","v":""},null,null,null,{"$f":"IF(LEN(Cotizador!$Q$54)>0,Cotizador!$Q$54,\"\")","v":""}]
[null,"Distrito",{"$f":"IF(LEN(Cotizador!$I$55)>0,Cotizador!$I$55,\"\")","v":""},null,null,null,{"$f":"IF(LEN(Cotizador!$M$55)>0,Cotizador!$M$55,\"\")","v":""},null,null,null,{"$f":"IF(LEN(Cotizador!$Q$55)>0,Cotizador!$Q$55,\"\")","v":""}]
[null,"Dirección exacta del riesgo:*:",{"$f":"IF(LEN(Cotizador!$I$56)>0,Cotizador!$I$56,\"\")","v":""},null,null,null,{"$f":"IF(LEN(Cotizador!$M$56)>0,Cotizador!$M$56,\"\")","v":""},null,null,null,{"$f":"IF(LEN(Cotizador!$Q$56)>0,Cotizador!$Q$56,\"\")","v":""}]
[null,"Nro",{"$f":"IF(LEN(Cotizador!$I$57)>0,Cotizador!$I$57,\"\")","v":""},null,null,null,{"$f":"IF(LEN(Cotizador!$M$57)>0,Cotizador!$M$57,\"\")","v":""},null,null,null,{"$f":"IF(LEN(Cotizador!$Q$57)>0,Cotizador!$Q$57,\"\")","v":""}]
[]
[]
[]
[null,"Año de construcción"]
[null,"Tipo de Material de Construccion"]
[null,"Número de Pisos"]
[null,"Número de Sotanos"]
[null,"mt2 construidos"]
[]
[null,"1.- COD MATERIAL","MATERIAL DE CONSTRUCCION","DEFINICIÓN","PISOS","SOTANOS","Local 1","Local 2","Local 3"]
[null,null,null,null,"# MAXIMO","# MAXIMO"]
[null,"3.0CA","PÓRTICOS DE CONCRETO ARMADO","Estuctura resistente formada por columnas y vigas de concreto armado, formando pórticos, las columnas pueden ser cuadradas o circulares.",10,10,"NO","NO","NO"]
[null,"4.0CP","PÓRTICOS DE CONCRETO ARMADO CON PLACAS","Similar a 3.OCA, adicionalmente cuenta con muros de concreto armado (placas) que aumentan la rigidez.",32,10,"NO","NO","NO"]
[null,"8.0M2R","MAMPOSTERÍA ARMADA O CONFINADA CON DIAFRAGMAS RÍGIDOS","Muros portantes de ladrillos de arcilla que tienen columnas de confinamiento en los extremos, o refuerzo interior de acero, con losas aligeradas o macizas.",4,1,"NO","NO","NO"]
[null,"9.0M2F","MAMPOSTERÍA ARMADA O CONFINADA CON DIAFRAGMAS FLEXIBLES","Muros portantes de ladrillos de arcilla que tienen columnas de confinamiento en los extremos, o refuerzo interior de acero, con piso o techo flexible de vigas de madera o acero.",4,1,"NO","NO","NO"]
[null,"1.0AC","PÓRTICO DE ACERO ARRIOSTRADO CON DIAGONALES","Estuctura formada por columnas y vigas de acero con refuerzos diagonales del mismo material.",32,10,"NO","NO","NO"]
[null,"2. Instalaciones eléctricas empotradas y/o entubadas en su totalidad"]
[null,"3. Cuenta con uno o más extintores contra incendio"]
[null,"4. Cuenta con vigilantes"]
[null,"5. Puertas exteriores (Rejas de fierro y/o cortina metálica y/o planchas de fierro, en su totalidad)"]
[null,"6. Ventanas protegidas por reja de fierro y/o reja plegadiza y/o cortina metálica, en su totalidad"]
[null,"7. Totalidad de su mercadería se encuentra almacenada en el interior de su local bajo las condiciones antes mencionadas"]
[null,"8. Los productos que almacena o tiene dentro de su local son combustibles y/o inflamables"]
[null,"9. La ubicación del inmueble ¿está a mas de 500 metros de distancia de un río, playa o laguna y a más de 15 metros de altura alguno de estos?"]
[]
[null,"PROTECCIÓN DE DATOS PERSONALES"]
[null,"Para la correcta ejecución de la relación contractual, EL CONTRATANTE / ASEGURADO (“EL CLIENTE”) se obliga a mantener actualizada su información personal, financiera y crediticia (“LA INFORMACIÓN”) y reconoce que PACÍFICO SEGUROS podrá tratarla, actualizarla, completarla y realizar flujos transfronterizos conforme a ley."]
[]
[]
[null,"PACÍFICO SEGUROS conservará, tratará y realizará flujos transfronterizos con LA INFORMACIÓN de EL CLIENTE mientras se mantenga la relación contractual y luego de veinte (20) años de finalizado el contrato.\nPara el tratamiento de La INFORMACIÓN de EL CLIENTE, PACÍFICO SEGUROS utilizará diversos Encargados ubicados en el Perú y el extranjero, los cuales se han puesto a disposición del El cliente y también se encuentran detallados en https://www.pacifico.com.pe/transparencia/politica-privacidad."]
[]
[]
[]
[]
[null," Su información será incluida en el banco de datos de Usuarios que se encuentra registrado ante la Autoridad de Protección de Datos Personales bajo el número de registro RNPDP-PJ N.° 774, de titularidad de PACÍFICO SEGUROS, ubicada en Juan de Arona 830, San Isidro, Lima - Perú."]
[]
[]
[null,"EL CLIENTE puede ejercer los derechos de acceso, rectificación, cancelación, revocación y oposición, dirigiéndose a PACÍFICO SEGUROS de forma presencial en cualquiera de sus oficinas a nivel nacional en el horario establecido para la atención al público o por teléfono o a través del Chat ubicado en nuestra página web www.pacifico.com.pe.\nEl detalle de nuestra Política de Privacidad se encuentra disponible en: \nhttps://www.pacifico.com.pe/transparencia/politica-privacidad"]
[]
[]
[]
[]
[null,"AUTORIZACIONES PARA USOS ADICIONALES"]
[null,"EL CLIENTE autoriza que PACÍFICO SEGUROS, de manera directa o a través de sus Encargados:\n- Le oferte cualquiera de nuestros productos de los ramos de Riesgos Generales o de Vida.\n- Le oferte cualquier otro producto o servicio de PACÍFICO SEGUROS o de sus empresas terceras.\n- A transferir su Información a empresas Credicorp (incluyendo subsidiarias, vinculadas y afiliadas) así como socios comerciales (Terceros), para que cada uno de ellos pueda ofertar sus productos o servicios. \n"]
[]
[]
[]
[]
[]
[null,"EL CLIENTE acepta haber tenido a su disposición la lista de Terceros y Encargados que también se encuentra disponible en https://www.pacifico.com.pe/transparencia/politica-privacidad. Dicha lista detalla los posibles usos que los Terceros darán a sus datos personales. El envío de comunicaciones o mensajes con las ofertas y/o publicidades podrá ser remitida a través de medios escritos, verbales (por ejemplo: mensajes, push notification o llamadas telefónicas) o electrónicos/informáticos (por ejemplo correo electrónico)."]
[]
[]
[]
[null,"PACÍFICO SEGUROS y los Terceros podrán conservar y tratar LA INFORMACIÓN de EL CLIENTE en los términos establecidos en esta sección, mientras se mantenga la relación contractual y luego de veinte (20) años de finalizado el contrato.\nLa aceptación o no de esta autorización para usos adicionales (ajenos a la ejecución de la relación contractual) no condiciona la prestación del servicio que EL CLIENTE está contratando.\n"]
[]
[]
[]
[]
[]
[]
[null,"Sí acepto"]
[null,"No acepto y"]
[null,"prefiero perder la oportunidad de recibir nuevas ofertas"]
[]
[null,"Cláusulas Abusivas"]
[null,"“Las condiciones de la presente póliza se encuentran sujetas a una revisión posterior por parte de la Superintendencia de Banca, Seguros y AFPs, por lo que, en caso se identiﬁquen cláusulas abusivas en el marco de la Ley del Contrato de Seguro y normas reglamentarias, y estas no sean subsanadas por PACÍFICO SEGUROS, la Superintendencia de Banca, Seguros y AFPs,"]
[]
[]
[null,"Derecho de arrepentimiento"]
[null,"En el caso que este seguro sea ofertado por un comercializador (incluyendo la Bancaseguro), declaro conocer que tengo derecho a arrepentirme de la contratación de este seguro, sin expresión de causa ni penalidad alguna, dentro del plazo de 15 días de recibir la póliza de seguro o el certiﬁcado de seguro, de ser el caso, ya que se me devuelva la prima que hubiere pagado."]
[]
[]
[]
["Pago de Primas (Datos vienen de la hoja Cotizador)"]
[]
[null,null,"Autorizaciones"]
[]
[null,null,"Forma de pago",{"$f":"IF(Cotizador!$E$82=0,\"\",Cotizador!$E$82)","v":""},null,null,null,null,null,"Emitir Factura?",{"$f":"IF(Cotizador!$I$82=0,\"\",Cotizador!$I$82)","v":""}]
[]
[]
[null,null,"Inicio de Vigencia y Pago"]
[null,null,null,null,null,null,null,null,null,"Nro. Cuotas:",{"$f":"IF(Cotizador!$I$87=0,\"\",Cotizador!$I$87)","v":""}]
[null,null,"Forma de pago",null,null,null,null,null,null,"Inicio Vigencia Póliza:",{"$f":"IF(Cotizador!$I$88=0,\"\",Cotizador!$I$88)","v":""}]
[null,null,"Al Contado",{"$f":"IF(LEN(D126)>0,IF(Cotizador!$AD$22=1,\"X\",\"\"),\"\")","v":""}]
[null,null,"En cuotas",{"$f":"IF(LEN(D126)>0,IF(Cotizador!$AD$22=2,\"X\",\"\"),\"\")","v":""}]
[null,null,null,null,null,null,null,null,null,"Monto Total a Pagar Anual:",{"$f":"IF(Cotizador!$P$91=0,0,Cotizador!$P$91) + IF(Cotizador!$P$102=0,0,Cotizador!$P$102)","v":0}]
[null,null,null,null,null,null,null,null,null,"Monto Total a Pagar Mensual:",{"$f":"IF(Cotizador!$P$92=0,0,Cotizador!$P$92) + IF(Cotizador!$P$103=0,0,Cotizador!$P$103)","v":0}]
[]
[]
["Datos del Corredor de Seguros"]
[]
[null,null,"Canal"]
[]
[null,null,null,null,null,null,null,null,"Tipo Canal:","Corredores"]
[]
[null,null,null,null,null,null,null,null,"Código o Número:"]
[]
[null,null,null,null,null,null,null,null,"Teléfono Corredor:"]
[]
[null,null,"Nombre del Corredor:",null,null,null,null,null,"Correo electrónico:"]

{"sheet":"Solicitud","index":7,"n_rows":359,"n_cols":34,"rows_kept":359,"cut":false,"hidden":false,"merged":[[225,11,225,16],[226,11,226,12],[231,2,232,33],[217,2,217,5],[215,2,215,5],[215,22,215,25],[261,2,261,9],[216,2,216,5],[216,22,216,25],[254,20,254,24],[255,12,255,15],[214,22,214,25],[210,2,212,5],[213,2,213,5],[214,2,214,5],[177,13,177,33],[175,1,175,12],[178,1,178,12],[180,13,180,33],[180,1,180,12],[268,2,268,33],[254,7,254,13],[255,4,255,10],[255,16,255,24],[217,22,217,25],[144,30,144,32],[144,13,144,15],[144,20,144,22],[183,13,183,33],[181,13,181,33],[182,13,182,33],[163,1,164,12],[165,1,167,12],[178,13,178,33],[145,23,145,25],[147,20,147,22],[147,13,147,15],[176,13,176,33],[163,13,164,33],[165,13,167,33],[175,13,175,33],[145,27,145,29],[213,22,213,25],[210,22,212,25],[154,31,154,33],[147,16,147,18],[146,20,146,22],[172,13,172,33],[173,13,173,33],[168,1,168,12],[169,1,169,12],[170,1,170,12],[171,1,171,12],[54,29,54,31],[62,8,62,12],[78,24,78,26],[72,7,72,22],[45,12,45,15],[45,16,45,24],[78,13,78,18],[78,19,78,23],[172,1,172,12],[143,27,143,29],[98,16,98,20],[98,21,98,23],[138,20,138,22],[139,20,139,22],[141,13,141,15],[142,13,142,15],[141,23,141,25],[142,20,142,22],[96,19,96,23],[142,27,142,29],[96,29,96,33],[98,6,98,7],[98,8,98,12],[141,27,141,29],[43,5,43,33],[44,4,44,11],[44,13,44,17],[44,18,44,21],[44,22,44,28],[44,30,44,33],[45,6,45,11],[45,29,45,33],[46,8,46,33],[25,8,25,33],[24,16,24,24],[24,12,24,15],[41,9,41,21],[24,6,24,11],[24,29,24,33],[31,24,31,33],[33,3,33,10],[36,24,36,33],[38,30,38,33],[40,24,40,25],[40,27,40,32],[41,23,41,24],[33,26,33,27],[33,28,33,33],[35,9,35,33],[36,7,36,19],[36,20,36,23],[40,6,40,11],[40,15,40,20],[33,12,33,18],[42,11,42,24],[94,5,94,33],[80,8,80,12],[60,13,60,18],[60,29,60,33],[90,29,90,31],[76,5,76,33],[78,4,78,11],[80,6,80,7],[90,23,90,25],[78,29,78,33],[72,23,72,25],[64,13,64,14],[82,13,82,14],[80,13,80,14],[80,16,80,20],[80,21,80,23],[42,29,42,33],[60,4,60,11],[62,21,62,23],[56,8,56,33],[58,5,58,33],[72,29,72,31],[60,19,60,23],[12,12,12,18],[23,18,23,21],[20,23,20,24],[20,9,20,21],[21,29,21,33],[15,24,15,33],[12,3,12,10],[21,11,21,24],[19,6,19,11],[15,20,15,23],[17,30,17,33],[12,26,12,27],[19,15,19,20],[19,24,19,25],[19,27,19,32],[23,13,23,17],[12,28,12,33],[15,7,15,19],[344,14,350,33],[305,2,310,12],[312,2,320,12],[327,2,331,12],[337,2,346,12],[279,14,287,33],[296,14,304,33],[321,14,323,33],[333,14,338,33],[291,2,299,12],[300,2,301,12],[278,2,288,12],[312,14,318,33],[290,14,290,33],[291,14,291,33],[7,1,7,33],[14,9,14,33],[23,4,23,11],[23,22,23,28],[23,30,23,33],[22,5,22,33],[272,2,272,33],[140,13,140,15],[138,27,138,29],[140,27,140,29],[54,7,54,22],[62,16,62,20],[62,6,62,7],[10,24,10,33],[96,13,96,18],[107,24,107,26],[124,2,125,13],[96,4,96,11],[121,2,122,13],[54,23,54,25],[74,8,74,33],[62,13,62,14],[92,8,92,33],[143,13,143,15],[358,4,358,11],[276,1,276,33],[270,2,270,33],[357,31,357,32],[274,2,274,33],[273,2,273,33],[271,2,271,33],[130,2,130,12],[133,2,133,34],[132,2,132,12],[138,30,138,32],[139,27,139,29],[139,30,139,32],[138,13,138,15],[138,16,138,18],[137,20,137,25],[137,13,137,18],[143,30,143,32],[139,13,139,15],[141,30,141,32],[142,30,142,32],[141,16,141,18],[141,20,141,22],[168,13,171,33],[107,31,107,33],[140,23,140,25],[127,2,128,13],[143,16,143,18],[137,27,137,32],[139,23,139,25],[140,30,140,32],[140,16,140,18],[140,20,140,22],[142,16,142,18],[139,16,139,18],[90,7,90,22],[60,24,60,26],[98,13,98,14],[96,24,96,26],[100,13,100,14],[144,23,144,25],[138,23,138,25],[144,16,144,18],[144,27,144,29],[107,18,107,20],[143,23,143,25],[142,23,142,25],[143,20,143,22],[269,2,269,33],[177,1,177,12],[145,13,145,15],[145,16,145,18],[145,20,145,22],[146,13,146,15],[146,16,146,18],[145,30,145,32],[146,23,146,25],[146,27,146,29],[181,1,181,12],[182,1,182,12],[179,13,179,33],[150,13,150,18],[150,20,150,25],[150,27,150,32],[174,1,174,12],[173,1,173,12],[147,30,147,32],[146,30,146,32],[147,23,147,25],[147,27,147,29],[154,18,154,20],[154,24,154,26]]}
[]
[]
[]
[]
[]
[]
[]
[null,{"$f":"\"Solicitud de Seguro - Multiriesgo Negocios \" & configuracion!$G$2","v":"Solicitud de Seguro - Multiriesgo Negocios JULIO 2022"}]
[null,null,"Contratante"]
[]
[null,null,"Persona Natural",null,null,null,null,null,{"$f":"IF(OR(Solicitud.Manual!$C$8=\"DNI\",Solicitud.Manual!$C$8=\"CE\"),\"X\",\"\")","v":""},null,null,"Persona Jurídica",null,{"$f":"IF(Solicitud.Manual!$C$8=\"RUC\",\"X\",\"\")","v":""},null,null,null,null,null,"Código de cliente",null,null,null,null,{"$f":"IF(LEN(Solicitud.Manual!$E$14)=0,\"\",Solicitud.Manual!$E$14)","v":""}]
[]
[null,null,"DNI",{"$f":"IF(Solicitud.Manual!$C$8=\"DNI\",Solicitud.Manual!$E$8,\"\")","v":""},null,null,null,null,null,null,null,"RUC",{"$f":"IF(Solicitud.Manual!$C$8=\"RUC\",Solicitud.Manual!$E$8,\"\")","v":""},null,null,null,null,null,null,"Otro (indicar tipo y numero)",null,null,null,null,null,null,{"$f":"IF(Solicitud.Manual!$C$8=\"CE\",Solicitud.Manual!$C$8,\"\")","v":""},null,{"$f":"IF(Solicitud.Manual!$C$8=\"CE\",Solicitud.Manual!$E$8,\"\")","v":""}]
[]
[null,null,"Nombre / Razon Social",null,null,null,null,null,null,{"$f":"IF(LEN(Solicitud.Manual!$C$9)=0,\"\",Solicitud.Manual!$C$9)","v":""}]
[null,null,"Apellido Paterno",null,null,null,null,{"$f":"IF(LEN(Solicitud.Manual!$C$10)=0,\"\",Solicitud.Manual!$C$10)","v":""},null,null,null,null,null,null,null,null,null,null,null,null,"Apellido Materno",null,null,null,{"$f":"IF(LEN(Solicitud.Manual!$E$10)=0,\"\",Solicitud.Manual!$E$10)","v":""}]
[]
[null,null,"Sexo",null,"F","M",null,null,null,null,null,null,null,null,null,null,"Fecha de Nacimiento",null,null,null,null,{"$f":"IF(LEN(Solicitud.Manual!$E$17)=0,\"\",DAY(Solicitud.Manual!$E$17))","v":""},{"$f":"IF(LEN(Solicitud.Manual!$E$17)=0,\"\",TEXT(MONTH(Solicitud.Manual!$E$17),\"00\"))","v":""},{"$f":"IF(LEN(Solicitud.Manual!$E$17)=0,\"\",TEXT(YEAR(Solicitud.Manual!$E$17),\"00\"))","v":""},null,null,null,null,null,"Estado Civil",{"$f":"IF(LEN(Solicitud.Manual!$E$18)=0,\"\",Solicitud.Manual!$E$18)","v":""}]
[null,null,null,null,null,null,null,null,null,null,null,null,null,null,null,null,null,null,null,null,null,"dd/","mm/","aa/"]
[null,null,"Nacionalidad",null,null,null,{"$f":"IF(LEN(Solicitud.Manual!$E$16)=0,\"\",Solicitud.Manual!$E$16)","v":""},null,null,null,null,null,"Profesion / Ocupación",null,null,{"$f":"IF(LEN(Solicitud.Manual!$E$15)=0,\"\",Solicitud.Manual!$E$15)","v":""},null,null,null,null,null,null,null,null,"Cargo",null,null,{"$f":"IF(LEN(Solicitud.Manual!$E$12)=0,\"\",Solicitud.Manual!$E$12)","v":""}]
[null,null,"Dirección (Jr / Cl / Av)",null,null,null,null,null,null,{"$f":"IF(LEN(Solicitud.Manual!$C$11)=0,\"\",Solicitud.Manual!$C$11)","v":""},null,null,null,null,null,null,null,null,null,null,null,null,"Nro",{"$f":"IF(LEN(Solicitud.Manual!$C$12)=0,\"\",Solicitud.Manual!$C$12)","v":""},null,null,null,null,"Dpto/Piso/Int",{"$f":"IF(LEN(Solicitud.Manual!$C$13)=0,\"\",Solicitud.Manual!$C$13)","v":""},"Mz",{"$f":"IF(LEN(Solicitud.Manual!$C$14)=0,\"\",Solicitud.Manual!$C$14)","v":""},"Lt",{"$f":"IF(LEN(Solicitud.Manual!$C$15)=0,\"\",Solicitud.Manual!$C$15)","v":""}]
[null,null,"Urbanización (Urb / AAHH / Coop)",null,null,null,null,null,null,null,null,null,null,null,null,null,null,null,null,null,null,null,null,null,null,null,null,null,"Sec / Etapa / Zona",{"$f":"IF(Solicitud.Manual!C17=\"\",\"\",Solicitud.Manual!C17)","v":""}]
[null,null,"Referencia"]
[null,null,"Distrito",null,{"$f":"IF(LEN(Solicitud.Manual!$C$16)=0,\"\",Solicitud.Manual!$C$16)","v":""},null,null,null,null,null,null,null,"Provincia",{"$f":"IF(LEN(Solicitud.Manual!$C$17)=0,\"\",Solicitud.Manual!$C$17)","v":""},null,null,null,null,"Departamento",null,null,null,{"$f":"IF(LEN(Solicitud.Manual!$C$18)=0,\"\",Solicitud.Manual!$C$18)","v":""},null,null,null,null,null,null,"País"]
[null,null,"Teléfono Casa",null,null,null,{"$f":"IF(LEN(Solicitud.Manual!$C$19)=0,\"\",Solicitud.Manual!$C$19)","v":""},null,null,null,null,null,"Teléfono trabajo",null,null,null,{"$f":"IF(LEN(Solicitud.Manual!$E$19)=0,\"\",Solicitud.Manual!$E$19)","v":""},null,null,null,null,null,null,null,null,null,null,null,"Teléfono Móvil",{"$f":"IF(LEN(Solicitud.Manual!$C$20)=0,\"\",Solicitud.Manual!$C$20)","v":""}]
[null,null,"Correo electrónico(*)",null,null,null,null,null,{"$f":"IF(LEN(Solicitud.Manual!$C$21)=0,\"\",Solicitud.Manual!$C$21)","v":""}]
[null,null,"(*) Para recibir información del contrato de seguro y/o cualquier comunicación necesaria para su ejecucion.",null,null,null,null,null,null,null,null,null,null,null,null,null,null,null,null,null,null,null,null,null,"Acepto",null,null,{"$f":"IF(Solicitud.Manual!$C$22=\"Acepto\",\"X\",\"\")","v":""},null,null,null,"No Acepto",null,{"$f":"IF(Solicitud.Manual!$C$22=\"No Acepto\",\"X\",\"\")","v":""}]
[null,null,"(*) Para recibir su póliza de forma electrónica",null,null,null,null,null,null,null,null,null,null,null,null,null,null,null,null,null,null,null,null,null,"Acepto",null,null,{"$f":"IF(Solicitud.Manual!$C$23=\"Acepto\",\"X\",\"\")","v":""},null,null,null,"No Acepto",null,{"$f":"IF(Solicitud.Manual!$C$23=\"No Acepto\",\"X\",\"\")","v":""}]
[]
[]
[null,null,"Asegurado  titular (llenar solo si es diferente del Contratante)"]
[null,null,"Persona Natural",null,null,null,null,null,{"$f":"IF(Solicitud.Manual!$I$7=\"NO\",\"\",IF(OR(Solicitud.Manual!$I$8=\"DNI\",Solicitud.Manual!$I$8=\"CE\"),\"X\",\"\"))","v":""},null,null,"Persona Jurídica",null,{"$f":"IF(Solicitud.Manual!$I$7=\"NO\",\"\",IF(Solicitud.Manual!$I$8=\"RUC\",\"X\",\"\"))","v":""},null,null,null,null,null,"Código de cliente",null,null,null,null,{"$f":"IF(Solicitud.Manual!$I$7=\"NO\",\"\",IF(Solicitud.Manual!$I$7=\"NO\",\"\",IF(LEN(Solicitud.Manual!$M$14)=0,\"\",Solicitud.Manual!$M$14)))","v":""}]
[]
[null,null,"DNI",{"$f":"IF(Solicitud.Manual!$I$7=\"NO\",\"\",IF(Solicitud.Manual!$I$8=\"DNI\",Solicitud.Manual!$M$8,\"\"))","v":""},null,null,null,null,null,null,null,"RUC",{"$f":"IF(Solicitud.Manual!$I$7=\"NO\",\"\",IF(Solicitud.Manual!$I$8=\"RUC\",Solicitud.Manual!$M$8,\"\"))","v":""},null,null,null,null,null,null,"Otro (indicar tipo y numero)",null,null,null,null,null,null,{"$f":"IF(Solicitud.Manual!$I$8=\"CE\",Solicitud.Manual!$I$8,\"\")","v":""},null,{"$f":"IF(Solicitud.Manual!$I$8=\"CE\",Solicitud.Manual!$M$8,\"\")","v":""}]
[]
[null,null,"Nombre / Razon Social",null,null,null,null,null,null,{"$f":"IF(Solicitud.Manual!$I$7=\"NO\",\"\",IF(LEN(Solicitud.Manual!$I$9)=0,\"\",Solicitud.Manual!$I$9))","v":""}]
[null,null,"Apellido Paterno",null,null,null,null,{"$f":"IF(Solicitud.Manual!$I$7=\"NO\",\"\",IF(LEN(Solicitud.Manual!$I$10)=0,\"\",Solicitud.Manual!$I$10))","v":""},null,null,null,null,null,null,null,null,null,null,null,null,"Apellido Materno",null,null,null,{"$f":"IF(Solicitud.Manual!$I$7=\"NO\",\"\",IF(LEN(Solicitud.Manual!$M$10)=0,\"\",Solicitud.Manual!$M$10))","v":""}]
[]
[null,null,"Sexo",null,"F","M",null,null,null,null,null,null,null,null,null,null,"Fecha de Nacimiento",null,null,null,null,{"$f":"IF(Solicitud.Manual!$I$7=\"NO\",\"\",IF(LEN(Solicitud.Manual!$M$17)=0,\"\",DAY(Solicitud.Manual!$M$17)))","v":""},{"$f":"IF(Solicitud.Manual!$I$7=\"NO\",\"\",IF(LEN(Solicitud.Manual!$M$17)=0,\"\",TEXT(MONTH(Solicitud.Manual!$M$17),\"00\")))","v":""},{"$f":"IF(Solicitud.Manual!$I$7=\"NO\",\"\",IF(LEN(Solicitud.Manual!$M$17)=0,\"\",TEXT(YEAR(Solicitud.Manual!$M$17),\"00\")))","v":""},null,null,null,null,null,"Estado Civil",{"$f":"IF(Solicitud.Manual!$I$7=\"NO\",\"\",IF(LEN(Solicitud.Manual!$M$18)=0,\"\",Solicitud.Manual!$M$18))","v":""}]
[null,null,null,null,null,null,null,null,null,null,null,null,null,null,null,null,null,null,null,null,null,"dd/","mm/","aa/"]
[null,null,"Nacionalidad",null,null,null,{"$f":"IF(Solicitud.Manual!$I$7=\"NO\",\"\",IF(LEN(Solicitud.Manual!$M$16)=0,\"\",Solicitud.Manual!$M$16))","v":""},null,null,null,null,null,"Profesion / Ocupación",null,null,{"$f":"IF(Solicitud.Manual!$I$7=\"NO\",\"\",IF(LEN(Solicitud.Manual!$M$15)=0,\"\",Solicitud.Manual!$M$15))","v":""},null,null,null,null,null,null,null,null,"Cargo",null,null,{"$f":"IF(Solicitud.Manual!$I$7=\"NO\",\"\",IF(LEN(Solicitud.Manual!$M$12)=0,\"\",Solicitud.Manual!$M$12))","v":""}]
[null,null,"Dirección (Jr / Cl / Av)",null,null,null,null,null,null,{"$f":"IF(Solicitud.Manual!$I$7=\"NO\",\"\",IF(LEN(Solicitud.Manual!$I$11)=0,\"\",Solicitud.Manual!$I$11))","v":""},null,null,null,null,null,null,null,null,null,null,null,null,"Nro",{"$f":"IF(Solicitud.Manual!$I$7=\"NO\",\"\",IF(LEN(Solicitud.Manual!$I$12)=0,\"\",Solicitud.Manual!$I$12))","v":""},null,null,null,null,"Dpto/Piso/Int",{"$f":"IF(Solicitud.Manual!$I$7=\"NO\",\"\",IF(LEN(Solicitud.Manual!$I$13)=0,\"\",Solicitud.Manual!$I$13))","v":""},"Mz",{"$f":"IF(Solicitud.Manual!$I$7=\"NO\",\"\",IF(LEN(Solicitud.Manual!$I$14)=0,\"\",Solicitud.Manual!$I$14))","v":""},"Lt",{"$f":"IF(Solicitud.Manual!$I$7=\"NO\",\"\",IF(LEN(Solicitud.Manual!$I$15)=0,\"\",Solicitud.Manual!$I$15))","v":""}]
[null,null,"Urbanización (Urb / AAHH / Coop)",null,null,null,null,null,null,null,null,null,null,null,null,null,null,null,null,null,null,null,null,null,null,null,null,null,"Sec / Etapa / Zona",{"$f":"IF(Solicitud.Manual!I17=\"\",\"\",Solicitud.Manual!I17)","v":""}]
[null,null,"Referencia"]
[null,null,"Distrito",null,{"$f":"IF(Solicitud.Manual!$I$7=\"NO\",\"\",IF(LEN(Solicitud.Manual!$I$16)=0,\"\",Solicitud.Manual!$I$16))","v":""},null,null,null,null,null,null,null,"Provincia",{"$f":"IF(Solicitud.Manual!$I$7=\"NO\",\"\",IF(LEN(Solicitud.Manual!$I$17)=0,\"\",Solicitud.Manual!$I$17))","v":""},null,null,null,null,"Departamento",null,null,null,{"$f":"IF(LEN(Solicitud.Manual!$I$18)=0,\"\",Solicitud.Manual!$I$18)","v":""},null,null,null,null,null,null,"País"]
[null,null,"Teléfono Casa",null,null,null,{"$f":"IF(LEN(Solicitud.Manual!$I$19)=0,\"\",Solicitud.Manual!$I$19)","v":""},null,null,null,null,null,"Teléfono trabajo",null,null,null,{"$f":"IF(Solicitud.Manual!$I$7=\"NO\",\"\",IF(LEN(Solicitud.Manual!$M$19)=0,\"\",Solicitud.Manual!$M$19))","v":""},null,null,null,null,null,null,null,null,null,null,null,"Teléfono Móvil",{"$f":"IF(Solicitud.Manual!$I$7=\"NO\",\"\",IF(LEN(Solicitud.Manual!$I$20)=0,\"\",Solicitud.Manual!$I$20))","v":""}]
[null,null,"Correo electrónico(*)",null,null,null,null,null,{"$f":"IF(Solicitud.Manual!$I$7=\"NO\",\"\",IF(LEN(Solicitud.Manual!$I$21)=0,\"\",Solicitud.Manual!$I$21))","v":""}]
[null,null,"(*) Para recibir información del contrato de seguro y/o cualquier comunicación necesaria para su ejecucion.",null,null,null,null,null,null,null,null,null,null,null,null,null,null,null,null,null,null,null,null,null,"Acepto",null,null,{"$f":"IF(Solicitud.Manual!$I$7=\"NO\",\"\",IF(Solicitud.Manual!$I$22=\"Acepto\",\"X\",\"\"))","v":""},null,null,null,"No Acepto",null,{"$f":"IF(Solicitud.Manual!$I$7=\"NO\",\"\",IF(Solicitud.Manual!$I$22=\"No Acepto\",\"X\",\"\"))","v":""}]
[null,null,"(*) Para recibir su póliza de forma electrónica",null,null,null,null,null,null,null,null,null,null,null,null,null,null,null,null,null,null,null,null,null,"Acepto",null,null,{"$f":"IF(Solicitud.Manual!$I$7=\"NO\",\"\",IF(Solicitud.Manual!$I$23=\"Acepto\",\"X\",\"\"))","v":""},null,null,null,"No Acepto",null,{"$f":"IF(Solicitud.Manual!$I$7=\"NO\",\"\",IF(Solicitud.Manual!$I$23=\"No Acepto\",\"X\",\"\"))","v":""}]
[]
[null,null,"Solicitud.Manual del Negocio a asegurar"]
[]
[null,null,"Local 1"]
[]
[null,null,"Actividad y/o giro",null,null,null,null,{"$f":"IF(LEN(Solicitud.Manual!$E$27)=0,\"\",Solicitud.Manual!$E$27)","v":""},null,null,null,null,null,null,null,null,null,null,null,null,null,null,null,"Comercio",null,null,null,null,null,"Servicio"]
[]
[null,null,"Ocupación del local",null,null,null,null,null,{"$f":"IF(LEN(Solicitud.Manual!$E$29)=0,\"\",Solicitud.Manual!$E$29)","v":""}]
[]
[null,null,"Dirección",null,null,{"$f":"IF(LEN(Solicitud.Manual!$C$47)=0,\"\",Solicitud.Manual!$C$47) & \" \" & IF(LEN(Solicitud.Manual!$C$48)=0,\"\",Solicitud.Manual!$C$48)","v":" "}]
[]
[null,null,"Distrito",null,{"$f":"IF(LEN(Solicitud.Manual!$C$46)=0,\"\",Solicitud.Manual!$C$46)","v":""},null,null,null,null,null,null,null,"Provincia",{"$f":"IF(LEN(Solicitud.Manual!$C$45)=0,\"\",Solicitud.Manual!$C$45)","v":""},null,null,null,null,null,"Departamento",null,null,null,null,{"$f":"IF(LEN(Solicitud.Manual!$C$44)=0,\"\",Solicitud.Manual!$C$44)","v":""},null,null,null,"País","Perú"]
[]
[null,null,"Nro. de pisos",null,null,null,{"$f":"IF(LEN(Solicitud.Manual!$C$54)=0,\"\",Solicitud.Manual!$C$54)","v":""},null,"Nro. de sótanos",null,null,null,null,{"$f":"IF(LEN(Solicitud.Manual!$C$55)=0,\"\",Solicitud.Manual!$C$55)","v":""},null,null,"Año de construcción",null,null,null,null,{"$f":"IF(LEN(Solicitud.Manual!$C$52)=0,\"\",Solicitud.Manual!$C$52)","v":""}]
[]
[null,null,"Metros construidos:",null,null,null,null,null,{"$f":"IF(LEN(Solicitud.Manual!$C$56)>0, Solicitud.Manual!$C$56,\"\")","v":""},null,"m2",null,"Tipo de Material de Construccion",{"$f":"IF(LEN(Solicitud.Manual!$C$53)=0,\"\",Solicitud.Manual!$C$53)","v":""}]
[]
[]
[]
[]
[]
[null,null,"Local 2"]
[]
[null,null,"Actividad y/o giro",null,null,null,null,{"$f":"IF(LEN(Solicitud.Manual!$E$32)=0,\"\",Solicitud.Manual!$E$32)","v":""},null,null,null,null,null,null,null,null,null,null,null,null,null,null,null,"Comercio",null,null,null,{"$f":"+IF(DatosdelNegocioLocal1!$I$12=\"Comercial\",\"X\",\"\")","v":""},null,"Servicio",null,null,{"$f":"+IF(DatosdelNegocioLocal1!$I$12=\"Servicios\",\"X\",\"\")","v":""}]
[]
[null,null,"Ocupación del local",null,null,null,null,null,{"$f":"IF(LEN(Solicitud.Manual!$E$34)=0,\"\",Solicitud.Manual!$E$34)","v":""}]
[]
[null,null,"Dirección",null,null,{"$f":"IF(LEN(Solicitud.Manual!$G$47)=0,\"\",Solicitud.Manual!$G$47) & \" \" & IF(LEN(Solicitud.Manual!$G$48)=0,\"\",Solicitud.Manual!$G$48)","v":" "}]
[]
[null,null,"Distrito",null,{"$f":"IF(LEN(Solicitud.Manual!$G$46)=0,\"\",Solicitud.Manual!$G$46)","v":""},null,null,null,null,null,null,null,"Provincia",{"$f":"IF(LEN(Solicitud.Manual!$G$45)=0,\"\",Solicitud.Manual!$G$45)","v":""},null,null,null,null,null,"Departamento",null,null,null,null,{"$f":"IF(LEN(Solicitud.Manual!$G$44)=0,\"\",Solicitud.Manual!$G$44)","v":""},null,null,null,"País","Perú"]
[]
[null,null,"Nro. de pisos",null,null,null,{"$f":"IF(LEN(Solicitud.Manual!$G$54)=0,\"\",Solicitud.Manual!$G$54)","v":""},null,"Nro. de sótanos",null,null,null,null,{"$f":"IF(LEN(Solicitud.Manual!$G$55)=0,\"\",Solicitud.Manual!$G$55)","v":""},null,null,"Año de construcción",null,null,null,null,{"$f":"IF(LEN(Solicitud.Manual!$G$52)=0,\"\",Solicitud.Manual!$G$52)","v":""}]
[]
[null,null,"Metros construidos:",null,null,null,null,null,{"$f":"IF(LEN(Solicitud.Manual!$G$56)>0, Solicitud.Manual!$G$56,\"\")","v":""},null,"m2",null,"Tipo de Material de Construccion",{"$f":"IF(LEN(Solicitud.Manual!$G$53)=0,\"\",Solicitud.Manual!$G$53)","v":""}]
[]
[]
[]
[]
[]
[null,null,"Local 3"]
[]
[null,null,"Actividad y/o giro",null,null,null,null,{"$f":"IF(LEN(Solicitud.Manual!$E$37)=0,\"\",Solicitud.Manual!$E$37)","v":""},null,null,null,null,null,null,null,null,null,null,null,null,null,null,null,"Comercio",null,null,null,{"$f":"+IF(DatosdelNegocioLocal1!$I$12=\"Comercial\",\"X\",\"\")","v":""},null,"Servicio",null,null,{"$f":"+IF(DatosdelNegocioLocal1!$I$12=\"Servicios\",\"X\",\"\")","v":""}]
[]
[null,null,"Ocupación del local",null,null,null,null,null,{"$f":"IF(LEN(Solicitud.Manual!$E$39)=0,\"\",Solicitud.Manual!$E$39)","v":""}]
[]
[null,null,"Dirección",null,null,{"$f":"IF(LEN(Solicitud.Manual!$K$47)=0,\"\",Solicitud.Manual!$K$47) & \" \" & IF(LEN(Solicitud.Manual!$K$48)=0,\"\",Solicitud.Manual!$K$48)","v":" "}]
[]
[null,null,"Distrito",null,{"$f":"IF(LEN(Solicitud.Manual!$K$46)=0,\"\",Solicitud.Manual!$K$46)","v":""},null,null,null,null,null,null,null,"Provincia",{"$f":"IF(LEN(Solicitud.Manual!$K$45)=0,\"\",Solicitud.Manual!$K$45)","v":""},null,null,null,null,null,"Departamento",null,null,null,null,{"$f":"IF(Solicitud.Manual!K44=\"\",\"\",Solicitud.Manual!K44)","v":""},null,null,null,"País","Perú"]
[]
[null,null,"Nro. de pisos",null,null,null,{"$f":"IF(LEN(Solicitud.Manual!$K$54)=0,\"\",Solicitud.Manual!$K$54)","v":""},null,"Nro. de sótanos",null,null,null,null,{"$f":"IF(LEN(Solicitud.Manual!$K$55)=0,\"\",Solicitud.Manual!$K$55)","v":""},null,null,"Año de construcción",null,null,null,null,{"$f":"IF(LEN(Solicitud.Manual!$K$52)=0,\"\",Solicitud.Manual!$K$52)","v":""}]
[]
[null,null,"Metros construidos:",null,null,null,null,null,{"$f":"IF(LEN(Solicitud.Manual!$K$56)>0, Solicitud.Manual!$K$56,\"\")","v":""},null,"m2",null,"Tipo de Material de Construccion",{"$f":"IF(LEN(Solicitud.Manual!$K$53)=0,\"\",Solicitud.Manual!$K$53)","v":""}]
[]
[]
[]
[]
[]
[]
[null,null,"Declaración Jurada",null,null,null,null,null,null,null,null,null,null,null,null,null,null,null,"Local 1",null,null,null,null,null,"Local 2",null,null,null,null,null,null,"Local 3"]
[null,null,"1.- TIPO DE MATERIAL DE CONSTRUCCION"]
[null,null,"PÓRTICOS DE CONCRETO ARMADO",null,null,null,null,null,null,null,null,null,null,null,null,null,null,"SI",{"$f":"IF(Solicitud.Manual!$G60=\"SÍ\",\"X\",\"\")","v":""},"No",{"$f":"IF(Solicitud.Manual!$G60=\"NO\",\"X\",\"\")","v":"X"},null,null,"SI",{"$f":"IF(Solicitud.Manual!$H60=\"SÍ\",\"X\",\"\")","v":""},"No",{"$f":"IF(Solicitud.Manual!$H60=\"NO\",\"X\",\"\")","v":"X"},null,null,null,"SI",{"$f":"IF(Solicitud.Manual!$I60=\"SÍ\",\"X\",\"\")","v":""},"No",{"$f":"IF(Solicitud.Manual!$I60=\"NO\",\"X\",\"\")","v":"X"}]
[null,null,"PÓRTICOS DE CONCRETO ARMADO CON PLACAS",null,null,null,null,null,null,null,null,null,null,null,null,null,null,"SI",{"$f":"IF(Solicitud.Manual!$G61=\"SÍ\",\"X\",\"\")","v":""},"No",{"$f":"IF(Solicitud.Manual!$G61=\"NO\",\"X\",\"\")","v":"X"},null,null,"SI",{"$f":"IF(Solicitud.Manual!$H61=\"SÍ\",\"X\",\"\")","v":""},"No",{"$f":"IF(Solicitud.Manual!$H61=\"NO\",\"X\",\"\")","v":"X"},null,null,null,"SI",{"$f":"IF(Solicitud.Manual!$I61=\"SÍ\",\"X\",\"\")","v":""},"No",{"$f":"IF(Solicitud.Manual!$I61=\"NO\",\"X\",\"\")","v":"X"}]
[null,null,"MAMPOSTERÍA ARMADA O CONFINADA CON DIAFRAGMAS RÍGIDOS",null,null,null,null,null,null,null,null,null,null,null,null,null,null,"SI",{"$f":"IF(Solicitud.Manual!$G62=\"SÍ\",\"X\",\"\")","v":""},"No",{"$f":"IF(Solicitud.Manual!$G62=\"NO\",\"X\",\"\")","v":"X"},null,null,"SI",{"$f":"IF(Solicitud.Manual!$H62=\"SÍ\",\"X\",\"\")","v":""},"No",{"$f":"IF(Solicitud.Manual!$H62=\"NO\",\"X\",\"\")","v":"X"},null,null,null,"SI",{"$f":"IF(Solicitud.Manual!$I62=\"SÍ\",\"X\",\"\")","v":""},"No",{"$f":"IF(Solicitud.Manual!$I62=\"NO\",\"X\",\"\")","v":"X"}]
[null,null,"MAMPOSTERÍA ARMADA O CONFINADA CON DIAFRAGMAS FLEXIBLES",null,null,null,null,null,null,null,null,null,null,null,null,null,null,"SI",{"$f":"IF(Solicitud.Manual!$G63=\"SÍ\",\"X\",\"\")","v":""},"No",{"$f":"IF(Solicitud.Manual!$G63=\"NO\",\"X\",\"\")","v":"X"},null,null,"SI",{"$f":"IF(Solicitud.Manual!$H63=\"SÍ\",\"X\",\"\")","v":""},"No",{"$f":"IF(Solicitud.Manual!$H63=\"NO\",\"X\",\"\")","v":"X"},null,null,null,"SI",{"$f":"IF(Solicitud.Manual!$I63=\"SÍ\",\"X\",\"\")","v":""},"No",{"$f":"IF(Solicitud.Manual!$I63=\"NO\",\"X\",\"\")","v":"X"}]
[null,null,"PÓRTICO DE ACERO ARRIOSTRADO CON DIAGONALES",null,null,null,null,null,null,null,null,null,null,null,null,null,null,"SI",{"$f":"IF(Solicitud.Manual!$G64=\"SÍ\",\"X\",\"\")","v":""},"No",{"$f":"IF(Solicitud.Manual!$G64=\"NO\",\"X\",\"\")","v":"X"},null,null,"SI",{"$f":"IF(Solicitud.Manual!$H64=\"SÍ\",\"X\",\"\")","v":""},"No",{"$f":"IF(Solicitud.Manual!$H64=\"NO\",\"X\",\"\")","v":"X"},null,null,null,"SI",{"$f":"IF(Solicitud.Manual!$I64=\"SÍ\",\"X\",\"\")","v":""},"No",{"$f":"IF(Solicitud.Manual!$I64=\"NO\",\"X\",\"\")","v":"X"}]
[]
[null,null,"2. Instalaciones eléctricas empotradas y/o entubadas en su totalidad",null,null,null,null,null,null,null,null,null,null,null,null,null,null,"SI",{"$f":"IF(Solicitud.Manual!$G$65=\"SÍ\",\"X\",\"\")","v":""},"No",{"$f":"IF(Solicitud.Manual!$G$65=\"NO\",\"X\",\"\")","v":""},null,null,"SI",{"$f":"IF(Solicitud.Manual!$H$65=\"SÍ\",\"X\",\"\")","v":""},"No",{"$f":"IF(Solicitud.Manual!$H$65=\"NO\",\"X\",\"\")","v":""},null,null,null,"SI",{"$f":"IF(Solicitud.Manual!$I$65=\"SÍ\",\"X\",\"\")","v":""},"No",{"$f":"IF(Solicitud.Manual!$I$65=\"NO\",\"X\",\"\")","v":""}]
[]
[null,null,"3. Cuenta con uno o más extintores contra incendio",null,null,null,null,null,null,null,null,null,null,null,null,null,null,"SI",{"$f":"IF(Solicitud.Manual!$G$66=\"SÍ\",\"X\",\"\")","v":""},"No",{"$f":"IF(Solicitud.Manual!$G$66=\"NO\",\"X\",\"\")","v":""},null,null,"SI",{"$f":"IF(Solicitud.Manual!$H$66=\"SÍ\",\"X\",\"\")","v":""},"No",{"$f":"IF(Solicitud.Manual!$H$66=\"NO\",\"X\",\"\")","v":""},null,null,null,"SI",{"$f":"IF(Solicitud.Manual!$I$66=\"SÍ\",\"X\",\"\")","v":""},"No",{"$f":"IF(Solicitud.Manual!$I$66=\"NO\",\"X\",\"\")","v":""}]
[]
[null,null,"4. Cuenta con vigilantes",null,null,null,null,null,null,null,null,null,null,null,null,null,null,"SI",{"$f":"IF(Solicitud.Manual!$G$67=\"SÍ\",\"X\",\"\")","v":""},"No",{"$f":"IF(Solicitud.Manual!$G$67=\"NO\",\"X\",\"\")","v":""},null,null,"SI",{"$f":"IF(Solicitud.Manual!$H$67=\"SÍ\",\"X\",\"\")","v":""},"No",{"$f":"IF(Solicitud.Manual!$H$67=\"NO\",\"X\",\"\")","v":""},null,null,null,"SI",{"$f":"IF(Solicitud.Manual!$I$67=\"SÍ\",\"X\",\"\")","v":""},"No",{"$f":"IF(Solicitud.Manual!$I$67=\"NO\",\"X\",\"\")","v":""}]
[]
[null,null,"5. Puertas exteriores (Rejas de fierro y/o cortina metálica y/o planchas de fierro, en su totalidad)",null,null,null,null,null,null,null,null,null,null,null,null,null,null,"SI",{"$f":"IF(Solicitud.Manual!$G$68=\"SÍ\",\"X\",\"\")","v":""},"No",{"$f":"IF(Solicitud.Manual!$G$68=\"NO\",\"X\",\"\")","v":""},null,null,"SI",{"$f":"IF(Solicitud.Manual!$H$68=\"SÍ\",\"X\",\"\")","v":""},"No",{"$f":"IF(Solicitud.Manual!$H$68=\"NO\",\"X\",\"\")","v":""},null,null,null,"SI",{"$f":"IF(Solicitud.Manual!$I$68=\"SÍ\",\"X\",\"\")","v":""},"No",{"$f":"IF(Solicitud.Manual!$I$68=\"NO\",\"X\",\"\")","v":""}]
[]
[]
[null,null,"6. Ventanas protegidas por reja de fierro y/o reja plegadiza y/o cortina metálica, en su totalidad",null,null,null,null,null,null,null,null,null,null,null,null,null,null,"SI",{"$f":"IF(Solicitud.Manual!$G$69=\"SÍ\",\"X\",\"\")","v":""},"No",{"$f":"IF(Solicitud.Manual!$G$69=\"NO\",\"X\",\"\")","v":""},null,null,"SI",{"$f":"IF(Solicitud.Manual!$H$69=\"SÍ\",\"X\",\"\")","v":""},"No",{"$f":"IF(Solicitud.Manual!$H$69=\"NO\",\"X\",\"\")","v":""},null,null,null,"SI",{"$f":"IF(Solicitud.Manual!$I$69=\"SÍ\",\"X\",\"\")","v":""},"No",{"$f":"IF(Solicitud.Manual!$I$69=\"NO\",\"X\",\"\")","v":""}]
[]
[]
[null,null,"7. Totalidad de su mercadería se encuentra almacenada en el interior de su local bajo las condiciones antes mencionadas",null,null,null,null,null,null,null,null,null,null,null,null,null,null,"SI",{"$f":"IF(Solicitud.Manual!$G$70=\"SÍ\",\"X\",\"\")","v":""},"No",{"$f":"IF(Solicitud.Manual!$G$70=\"NO\",\"X\",\"\")","v":""},null,null,"SI",{"$f":"IF(Solicitud.Manual!$H$70=\"SÍ\",\"X\",\"\")","v":""},"No",{"$f":"IF(Solicitud.Manual!$H$70=\"NO\",\"X\",\"\")","v":""},null,null,null,"SI",{"$f":"IF(Solicitud.Manual!$I$70=\"SÍ\",\"X\",\"\")","v":""},"No",{"$f":"IF(Solicitud.Manual!$I$70=\"NO\",\"X\",\"\")","v":""}]
[]
[]
[null,null,"8. Los productos que almacena o tiene dentro de su local son combustibles y/o inflamables",null,null,null,null,null,null,null,null,null,null,null,null,null,null,"SI",{"$f":"IF(Solicitud.Manual!$G$71=\"SÍ\",\"X\",\"\")","v":""},"No",{"$f":"IF(Solicitud.Manual!$G$71=\"NO\",\"X\",\"\")","v":""},null,null,"SI",{"$f":"IF(Solicitud.Manual!$H$71=\"SÍ\",\"X\",\"\")","v":""},"No",{"$f":"IF(Solicitud.Manual!$H$71=\"NO\",\"X\",\"\")","v":""},null,null,null,"SI",{"$f":"IF(Solicitud.Manual!$I$71=\"SÍ\",\"X\",\"\")","v":""},"No",{"$f":"IF(Solicitud.Manual!$I$71=\"NO\",\"X\",\"\")","v":""}]
[]
[null,null,"9. La ubicación del inmueble ¿está a mas de 500 metros de distancia de un río, playa o laguna y a más de 15 metros de altura alguno de estos?",null,null,null,null,null,null,null,null,null,null,null,null,null,null,"SI",{"$f":"IF(Solicitud.Manual!$G$72=\"SÍ\",\"X\",\"\")","v":""},"No",{"$f":"IF(Solicitud.Manual!$G$72=\"NO\",\"X\",\"\")","v":""},null,null,"SI",{"$f":"IF(Solicitud.Manual!$H$72=\"SÍ\",\"X\",\"\")","v":""},"No",{"$f":"IF(Solicitud.Manual!$H$72=\"NO\",\"X\",\"\")","v":""},null,null,null,"SI",{"$f":"IF(Solicitud.Manual!$I$72=\"SÍ\",\"X\",\"\")","v":""},"No",{"$f":"IF(Solicitud.Manual!$I$72=\"NO\",\"X\",\"\")","v":""}]
[]
[null,null,"Declaración de Bienes"]
[null,null,"Tipo moneda"]
[null,null,"US Dólares",null,null,null,null,{"$f":"+IF(CoberturasaElegirLocal1!$I$8=\"USD\",\"X\",\"\")","v":"X"}]
[null,null,null,null,null,null,null,null,null,null,null,null,null,"Local 1",null,null,null,null,null,null,"Local 2",null,null,null,null,null,null,"Local 3"]
[null,null,null,null,null,null,null,null,null,null,null,null,null,"Valor",null,null,"Valor",null,null,null,"Valor",null,null,"Valor",null,null,null,"Valor",null,null,"Valor"]
[null,null,null,null,null,null,null,null,null,null,null,null,null,"Declarado",null,null,"Endosado",null,null,null,"Declarado",null,null,"Endosado",null,null,null,"Declarado",null,null,"Endosado"]
[null,1,{"$f":"+CoberturasaElegirLocal1!H11","v":"Edificio (sin considerar el valor del terreno)"},null,null,null,null,null,null,null,null,null,null,{"$f":"+IF(CoberturasaElegirLocal1!$M$11=\"\",\"\",CoberturasaElegirLocal1!$M$11)","v":""},null,null,{"$f":"+IF(CoberturasaElegirLocal1!$N$11=\"\",\"\",CoberturasaElegirLocal1!$N$11)","v":""},null,null,null,{"$f":"+IF(CoberturasaElegirLocal2!$M$11=\"\",\"\",CoberturasaElegirLocal2!$M$11)","v":""},null,null,{"$f":"+IF(CoberturasaElegirLocal2!$N$11=\"\",\"\",CoberturasaElegirLocal2!$N$11)","v":""},null,null,null,{"$f":"+IF(CoberturasaElegirLocal3!$M$11=\"\",\"\",CoberturasaElegirLocal3!$M$11)","v":""},null,null,{"$f":"+IF(CoberturasaElegirLocal3!$N$11=\"\",\"\",CoberturasaElegirLocal3!$N$11)","v":""}]
[null,2,{"$f":"+IF(CoberturasaElegirLocal1!H12=\"\",\"\",CoberturasaElegirLocal1!H12)","v":"Instalaciones fijas"},null,null,null,null,null,null,null,null,null,null,{"$f":"+IF(CoberturasaElegirLocal1!$M$12=\"\",\"\",CoberturasaElegirLocal1!$M$12)","v":""},null,null,{"$f":"+IF(CoberturasaElegirLocal1!$N$12=\"\",\"\",CoberturasaElegirLocal1!$N$12)","v":""},null,null,null,{"$f":"+IF(CoberturasaElegirLocal2!$M$12=\"\",\"\",CoberturasaElegirLocal2!$M$12)","v":""},null,null,{"$f":"+IF(CoberturasaElegirLocal2!$N$12=\"\",\"\",CoberturasaElegirLocal2!$N$12)","v":""},null,null,null,{"$f":"+IF(CoberturasaElegirLocal3!$M$12=\"\",\"\",CoberturasaElegirLocal3!$M$12)","v":""},null,null,{"$f":"+IF(CoberturasaElegirLocal3!$N$12=\"\",\"\",CoberturasaElegirLocal3!$N$12)","v":""}]
[null,3,{"$f":"+CoberturasaElegirLocal1!H13","v":"Mobiliario y/o contenido propios del giro"},null,null,null,null,null,null,null,null,null,null,{"$f":"+IF(CoberturasaElegirLocal1!$M$13=\"\",\"\",CoberturasaElegirLocal1!$M$13)","v":""},null,null,{"$f":"+IF(CoberturasaElegirLocal1!$N$13=\"\",\"\",CoberturasaElegirLocal1!$N$13)","v":""},null,null,null,{"$f":"+IF(CoberturasaElegirLocal2!$M$13=\"\",\"\",CoberturasaElegirLocal2!$M$13)","v":""},null,null,{"$f":"+IF(CoberturasaElegirLocal2!$N$13=\"\",\"\",CoberturasaElegirLocal2!$N$13)","v":""},null,null,null,{"$f":"+IF(CoberturasaElegirLocal3!$M$13=\"\",\"\",CoberturasaElegirLocal3!$M$13)","v":""},null,null,{"$f":"+IF(CoberturasaElegirLocal3!$N$13=\"\",\"\",CoberturasaElegirLocal3!$N$13)","v":""}]
[null,4,{"$f":"+CoberturasaElegirLocal1!H14","v":"Existencias propias del giro del negocio"},null,null,null,null,null,null,null,null,null,null,{"$f":"+IF(CoberturasaElegirLocal1!$M$14=\"\",\"\",CoberturasaElegirLocal1!$M$14)","v":""},null,null,{"$f":"+IF(CoberturasaElegirLocal1!$N$14=\"\",\"\",CoberturasaElegirLocal1!$N$14)","v":""},null,null,null,{"$f":"+IF(CoberturasaElegirLocal2!$M$14=\"\",\"\",CoberturasaElegirLocal2!$M$14)","v":""},null,null,{"$f":"+IF(CoberturasaElegirLocal2!$N$14=\"\",\"\",CoberturasaElegirLocal2!$N$14)","v":""},null,null,null,{"$f":"+IF(CoberturasaElegirLocal3!$M$14=\"\",\"\",CoberturasaElegirLocal3!$M$14)","v":""},null,null,{"$f":"+IF(CoberturasaElegirLocal3!$N$14=\"\",\"\",CoberturasaElegirLocal3!$N$14)","v":""}]
[null,5,{"$f":"+CoberturasaElegirLocal1!H15","v":"Maquinaria propia del giro del negocio"},null,null,null,null,null,null,null,null,null,null,{"$f":"+IF(CoberturasaElegirLocal1!$M$15=\"\",\"\",CoberturasaElegirLocal1!$M$15)","v":""},null,null,{"$f":"+IF(CoberturasaElegirLocal1!$N$15=\"\",\"\",CoberturasaElegirLocal1!$N$15)","v":""},null,null,null,{"$f":"+IF(CoberturasaElegirLocal2!$M$15=\"\",\"\",CoberturasaElegirLocal2!$M$15)","v":""},null,null,{"$f":"+IF(CoberturasaElegirLocal2!$N$15=\"\",\"\",CoberturasaElegirLocal2!$N$15)","v":""},null,null,null,{"$f":"+IF(CoberturasaElegirLocal3!$M$15=\"\",\"\",CoberturasaElegirLocal3!$M$15)","v":""},null,null,{"$f":"+IF(CoberturasaElegirLocal3!$N$15=\"\",\"\",CoberturasaElegirLocal3!$N$15)","v":""}]
[null,6,{"$f":"+CoberturasaElegirLocal1!H16","v":"Equipos electrónicos propios del giro del negocio"},null,null,null,null,null,null,null,null,null,null,{"$f":"+IF(CoberturasaElegirLocal1!$M$16=\"\",\"\",CoberturasaElegirLocal1!$M$16)","v":""},null,null,{"$f":"+IF(CoberturasaElegirLocal1!$N$16=\"\",\"\",CoberturasaElegirLocal1!$N$16)","v":""},null,null,null,{"$f":"+IF(CoberturasaElegirLocal2!$M$16=\"\",\"\",CoberturasaElegirLocal2!$M$16)","v":""},null,null,{"$f":"+IF(CoberturasaElegirLocal2!$N$16=\"\",\"\",CoberturasaElegirLocal2!$N$16)","v":""},null,null,null,{"$f":"+IF(CoberturasaElegirLocal3!$M$16=\"\",\"\",CoberturasaElegirLocal3!$M$16)","v":""},null,null,{"$f":"+IF(CoberturasaElegirLocal3!$N$16=\"\",\"\",CoberturasaElegirLocal3!$N$16)","v":""}]
[null,7,{"$f":"+CoberturasaElegirLocal1!H17","v":"Lucro Cesante"},null,null,null,null,null,null,null,null,null,null,{"$f":"+IF(CoberturasaElegirLocal1!$M$17=\"\",\"\",CoberturasaElegirLocal1!$M$17)","v":""},null,null,{"$f":"+IF(CoberturasaElegirLocal1!$N$17=\"\",\"\",CoberturasaElegirLocal1!$N$17)","v":""},null,null,null,{"$f":"+IF(CoberturasaElegirLocal2!$M$17=\"\",\"\",CoberturasaElegirLocal2!$M$17)","v":""},null,null,{"$f":"+IF(CoberturasaElegirLocal2!$N$17=\"\",\"\",CoberturasaElegirLocal2!$N$17)","v":""},null,null,null,{"$f":"+IF(CoberturasaElegirLocal3!$M$17=\"\",\"\",CoberturasaElegirLocal3!$M$17)","v":""},null,null,{"$f":"+IF(CoberturasaElegirLocal3!$N$17=\"\",\"\",CoberturasaElegirLocal3!$N$17)","v":""}]
[null,null,"(*) Valor total declarado por local",null,null,null,null,null,null,null,null,null,null,{"$f":"+IF(CoberturasaElegirLocal1!$M$18=\"\",\"\",CoberturasaElegirLocal1!$M$18)","v":""},null,null,{"$f":"+IF(CoberturasaElegirLocal1!$N$18=\"\",\"\",CoberturasaElegirLocal1!$N$18)","v":""},null,null,null,{"$f":"+IF(CoberturasaElegirLocal2!$M$18=\"\",\"\",CoberturasaElegirLocal2!$M$18)","v":""},null,null,{"$f":"+IF(CoberturasaElegirLocal2!$N$18=\"\",\"\",CoberturasaElegirLocal2!$N$18)","v":""},null,null,null,{"$f":"+IF(CoberturasaElegirLocal3!$M$18=\"\",\"\",CoberturasaElegirLocal3!$M$18)","v":""},null,null,{"$f":"+IF(CoberturasaElegirLocal3!$N$18=\"\",\"\",CoberturasaElegirLocal3!$N$18)","v":""}]
[null,null,"(*) Limitado a US$ 2,000,000 y/o su equivalente en moneda nacional"]
[]
[null,null,null,null,null,null,null,null,null,null,null,null,"Endosado a favor de:",{"$f":"IF(Cotizador!$H$8=0,\"\",Cotizador!$H$8)","v":""},null,null,null,null,null,null,{"$f":"IF(Cotizador!$M$8=0,\"\",Cotizador!$M$8)","v":""},null,null,null,null,null,null,{"$f":"IF(Cotizador!$R$8=0,\"\",Cotizador!$R$8)","v":""}]
[]
[null,null,"Coberturas"]
[]
[null,"1) Sección incendio y líneas aliadas",null,null,null,null,null,null,null,null,null,null,null,null,null,null,null,null,"Local 1",null,null,null,null,null,"Local 2",null,null,null,null,null,null,"Local 3"]
[]
[null,"A valor total",null,null,null,null,null,null,null,null,null,null,null,null,null,null,null,null,null,{"$f":"IF(Cotizador!$H$16 =0,\"X\",\"\")","v":"X"},null,null,null,null,null,{"$f":"IF(Cotizador!$M$16 =0,\"X\",\"\")","v":"X"},null,null,null,null,null,null,{"$f":"IF(Cotizador!$R$16 =0,\"X\",\"\")","v":"X"}]
[null,"A valor total incluido lucro cesante, periodo incial 12 meses ( Limite único combinado)",null,null,null,null,null,null,null,null,null,null,null,null,null,null,null,null,null,{"$f":"IF(Cotizador!$H$16>0,\"X\",\"\")","v":""},null,null,null,null,null,{"$f":"IF(Cotizador!$M$16>0,\"X\",\"\")","v":""},null,null,null,null,null,null,{"$f":"IF(Cotizador!$R$16>0,\"X\",\"\")","v":""}]
[]
[null,"A valor total"]
[null,"Bajo esta modalidad queda convenido que EL ASEGURADO fijará la suma asegurada, la cual debe coincidir con el Valor de"]
[null,"Reposición a Nuevo de la totalidad de los bienes que conforman la materia asegurada."]
[]
[null,"Sub Límites [1]",null,null,null,null,null,null,null,null,null,null,null,"Límite US $"]
[]
[null,"Huelga, Motín, Conmoción Civil, Daño Malicioso, Vandalismo y / o Terrorismo en el agregado por vigencia. (Límite Único y Combinado)",null,null,null,null,null,null,null,null,null,null,null,"Hasta el 100% del valor declarado, límite máximo US$ 2'000,000"]
[]
[]
[null,"Gastos Extraordinarios: (Límite Único y Combinado)",null,null,null,null,null,null,null,null,null,null,null,"Hasta el 20% del valor declarado, límite máximo US$ 400,000.00"]
[null," - Honorarios Arquitectos, topógrafos e Ingenieros"]
[null," - Documentos y Modelos"]
[null," - Remoción de Escombros"]
[null,"Cobertura Automática para Nuevas Adquisiciones, máximo 30 días",null,null,null,null,null,null,null,null,null,null,null,"Hasta el 20% del valor declarado, límite máximo"]
[null,"para declaración a PACÍFICO.",null,null,null,null,null,null,null,null,null,null,null,"US$ 100,000.00"]
[null,"(Aplica sólo si cuenta con contenido, equipos y maquinaria)"]
[null,"Rotura Accidental de Vidrios, Cristales y/o Avisos luminosos. Aplica",null,null,null,null,null,null,null,null,null,null,null,"Hasta el 10% del valor declarado límite máximo"]
[null,"para contenido y edificación.",null,null,null,null,null,null,null,null,null,null,null,"US$ 5,000.00"]
[]
[null,"Gastos extras",null,null,null,null,null,null,null,null,null,null,null,"Hasta el 20% del valor declarado límite máximo"]
[null,null,null,null,null,null,null,null,null,null,null,null,null,"US$ 400,000.00"]
[]
[null,"Refrigeración ( Aplica a Grupo \"A\": restaurantes, hoteles, panaderías,",null,null,null,null,null,null,null,null,null,null,null,"US$5,000 por evento y 20,000 Límite Agregado Anual"]
[null,"heladerías, carnicerías y bodegas)"]
[]
[null,"[1] Forman parte de la Suma Asegurada, no son Adicionales"]
[]
[null,"2) Sección Rotura de Maquinaria"]
[]
[null,null,"Hasta el 100% del valor declarado de la maquinaria fija en la sección de incendio, limitado hasta US$ 200,000 y/o su equivalente"]
[null,null,"en moneda nacional."]
[]
[null,"3) Sección Equipo Electrónico"]
[]
[null,null,"Hasta el 100% del valor declarado de equipo electrónico en la sección de incendio, limitado hasta US$ 50,000 y/o su equivalente"]
[null,null,"en moneda nacional."]
[null,null,"Laptops y/o notebooks hasta el 100% de la suma asegurada de equipo electrónico, limitado hasta US$ 3,000.00 y/o su"]
[null,null,"equivalente en moneda nacional y en límite agregado vigencia."]
[]
[null,"4) Sección Robo y/o Asalto"]
[]
[null,null,"Hasta el 100% del valor declarado total de activos (excepto edificio) limitado hasta US$ 100,000.00 y/o su equivalente en"]
[null,null,"moneda nacional."]
[null,null,"Dinero en tránsito máximo US$ 3,000.00 y/o su equivalente en moderna nacional y en límite agregado por vigencia."]
[null,null,"Dinero dentro del local hasta US$ 3,000.00 y/o su equivalente en moderna nacional y en límite agregado vigencia."]
[]
[null,"5) Sección Responsabilidad Civil"]
[]
[null,null,"Responsabilidad civil extracontractual hasta el 100% del valor declarado de incendio, limitado hasta US$ 200,000.00 en límite"]
[null,null,"agregado vigencia y/o su equivalente en moneda nacional."]
[]
[null,null,"Límite Asegurado (excepto hoteles hasta US$)",null,null,null,null,null,null,null,null,null,null,null,null,null,null,null,null,null,null,null,"Solo hoteles hasta US$"]
[]
[null,null,null,null,null,null,null,"Local 1",null,"Local 2",null,"Local 3",null,null,null,null,null,null,null,null,null,null,null,null,null,null,null,"Local 1",null,"Local 2",null,"Local 3"]
[null,null,50000,null,null,null,null,{"$f":"IF(DatosdelNegocioLocal1!$AH$6<>13, IF($C$214=Cotizador!$I$33,\"X\",\"\"),\"\")","v":""},null,{"$f":"IF(DatosdelNegocioLocal2!$AH$6<>13, IF($C$214=Cotizador!$N$33,\"X\",\"\"),\"\")","v":""},null,{"$f":"IF(DatosdelNegocioLocal3!$AH$6<>13, IF($C$214=Cotizador!$S$33,\"X\",\"\"),\"\")","v":""},null,null,null,null,null,null,null,null,null,null,50000,null,null,null,null,{"$f":"IF(DatosdelNegocioLocal1!$AH$6=13,IF($W$214=Cotizador!$I$33,\"X\",\"\"),\"\")","v":""},null,{"$f":"IF(DatosdelNegocioLocal2!$AH$6=13,IF($W$214=Cotizador!$N$33,\"X\",\"\"),\"\")","v":""},null,{"$f":"IF(DatosdelNegocioLocal3!$AH$6=13,IF($W$214=Cotizador!$S$33,\"X\",\"\"),\"\")","v":""}]
[null,null,100000,null,null,null,null,{"$f":"IF(DatosdelNegocioLocal1!$AH$6<>13, IF($C$215=Cotizador!$I$33,\"X\",\"\"),\"\")","v":""},null,{"$f":"IF(DatosdelNegocioLocal2!$AH$6<>13, IF($C$215=Cotizador!$N$33,\"X\",\"\"),\"\")","v":""},null,{"$f":"IF(DatosdelNegocioLocal3!$AH$6<>13, IF($C$215=Cotizador!$S$33,\"X\",\"\"),\"\")","v":""},null,null,null,null,null,null,null,null,null,null,100000,null,null,null,null,{"$f":"IF(DatosdelNegocioLocal1!$AH$6=13,IF($W$215=Cotizador!$I$33,\"X\",\"\"),\"\")","v":""},null,{"$f":"IF(DatosdelNegocioLocal2!$AH$6=13,IF($W$215=Cotizador!$N$33,\"X\",\"\"),\"\")","v":""},null,{"$f":"IF(DatosdelNegocioLocal3!$AH$6=13,IF($W$215=Cotizador!$S$33,\"X\",\"\"),\"\")","v":""}]
[null,null,200000,null,null,null,null,{"$f":"IF(DatosdelNegocioLocal1!$AH$6<>13, IF($C$216=Cotizador!$I$33,\"X\",\"\"),\"\")","v":""},null,{"$f":"IF(DatosdelNegocioLocal2!$AH$6<>13, IF($C$216=Cotizador!$N$33,\"X\",\"\"),\"\")","v":""},null,{"$f":"IF(DatosdelNegocioLocal3!$AH$6<>13, IF($C$216=Cotizador!$S$33,\"X\",\"\"),\"\")","v":""},null,null,null,null,null,null,null,null,null,null,200000,null,null,null,null,{"$f":"IF(DatosdelNegocioLocal1!$AH$6=13,IF($W$216=Cotizador!$I$33,\"X\",\"\"),\"\")","v":""},null,{"$f":"IF(DatosdelNegocioLocal2!$AH$6=13,IF($W$216=Cotizador!$N$33,\"X\",\"\"),\"\")","v":""},null,{"$f":"IF(DatosdelNegocioLocal3!$AH$6=13,IF($W$216=Cotizador!$S$33,\"X\",\"\"),\"\")","v":""}]
[null,null,300000,null,null,null,null,{"$f":"IF(DatosdelNegocioLocal1!$AH$6<>13, IF($C$217=Cotizador!$I$33,\"X\",\"\"),\"\")","v":""},null,{"$f":"IF(DatosdelNegocioLocal2!$AH$6<>13, IF($C$217=Cotizador!$N$33,\"X\",\"\"),\"\")","v":""},null,{"$f":"IF(DatosdelNegocioLocal3!$AH$6<>13, IF($C$217=Cotizador!$S$33,\"X\",\"\"),\"\")","v":""},null,null,null,null,null,null,null,null,null,null,300000,null,null,null,null,{"$f":"IF(DatosdelNegocioLocal1!$AH$6=13,IF($W$217=Cotizador!$I$33,\"X\",\"\"),\"\")","v":""},null,{"$f":"IF(DatosdelNegocioLocal2!$AH$6=13,IF($W$217=Cotizador!$N$33,\"X\",\"\"),\"\")","v":""},null,{"$f":"IF(DatosdelNegocioLocal3!$AH$6=13,IF($W$217=Cotizador!$S$33,\"X\",\"\"),\"\")","v":""}]
[null,null,500000,null,null,null,null,{"$f":"IF(DatosdelNegocioLocal1!$AH$6<>13, IF($C$218=Cotizador!$I$33,\"X\",\"\"),\"\")","v":""},null,{"$f":"IF(DatosdelNegocioLocal2!$AH$6<>13, IF($C$218=Cotizador!$N$33,\"X\",\"\"),\"\")","v":""},null,{"$f":"IF(DatosdelNegocioLocal3!$AH$6<>13, IF($C$218=Cotizador!$S$33,\"X\",\"\"),\"\")","v":""},null,null,null,null,null,null,null,null,null,null,500000,null,null,null,null,{"$f":"IF(DatosdelNegocioLocal1!$AH$6=13,IF($W$218=Cotizador!$I$33,\"X\",\"\"),\"\")","v":""},null,{"$f":"IF(DatosdelNegocioLocal2!$AH$6=13,IF($W$218=Cotizador!$N$33,\"X\",\"\"),\"\")","v":""},null,{"$f":"IF(DatosdelNegocioLocal3!$AH$6=13,IF($W$218=Cotizador!$S$33,\"X\",\"\"),\"\")","v":""}]
[]
[]
[null,"6) Sección Transporte"]
[null,null,"Hasta el límite máximo por embarque ( Límite agregado anual)"]
[]
[null,null,"Contratacion del Seguros de Transportes",null,null,null,null,null,null,null,null,{"$f":"IF(LEN(CuestionarioTransporte!$C$12)>0,\"X\",\"\")","v":""}]
[]
[null,null,"Tipo de Contratación",null,null,null,null,null,null,null,null,{"$f":"IF(LEN(CuestionarioTransporte!$C$12)>0,CuestionarioTransporte!$C$12,\"\")","v":""}]
[null,null,"Movimiento Estimado Anual (en USD) ",null,null,null,null,null,null,null,null,{"$f":"IF(LEN(CuestionarioTransporte!$D$24)>0,CuestionarioTransporte!$D$24,\"\")","v":""},null,null,null,"Límite Máximo por Embarque ( Limite agregado anual)  :   $ 25, 0000"]
[]
[]
[null,null,"Pago de prima"]
[]
[null,null,"De acuerdo a lo establecido en el art. Nro 3, de la resolucion SBS 3198-2013, reglamento de pago de primas, la cobertura se inicia con la aceptacion de la solicitud y el pago de la prima. La forma de pago se aplicará a las posteriores renovaciones, salvo modificaciones por parte del contratante. La forma de pago es:"]
[]
[]
[]
[null,null,null,null,null,null,null,{"$f":"IF(Cotizador!$E$82=\"Débito Automático\",\"X\",\"\")","v":""},"Débito Automático",null,null,null,null,null,null,null,null,{"$f":"IF(Cotizador!$E$82=\"Cupones\",\"X\",\"\")","v":""},"Cupones",null,null,"Persona Juridica"]
[]
[]
[null,null,null,null,null,null,null,null,{"$f":"IF($H$236=\"X\",IF(Cotizador!$AD$22=1,\"X\",\"\"),\"\")","v":""},"Contado",null,null,null,null,null,null,null,null,{"$f":"IF($R$236=\"X\",IF(Cotizador!$AD$22=1,\"X\",\"\"),\"\")","v":""},"Contado"]
[]
[null,null,null,null,null,null,null,null,{"$f":"IF($H$236=\"X\",IF(AND(Cotizador!$AD$22<>1,Cotizador!$I$87=4),\"X\",\"\"),\"\")","v":""},"4 cuotas sin intereses",null,null,null,null,null,null,null,null,{"$f":"IF($R$236=\"X\",IF(AND(Cotizador!$AD$22<>1,Cotizador!$I$87=4),\"X\",\"\"),\"\")","v":""},"4 cuotas"]
[]
[null,null,null,null,null,null,null,null,{"$f":"IF($H$236=\"X\",IF(AND(Cotizador!$AD$22<>1,Cotizador!$I$87=6),\"X\",\"\"),\"\")","v":""},"6 cuotas  sin intereses",null,null,null,null,null,null,null,null,{"$f":"IF($R$236=\"X\",IF(AND(Cotizador!$AD$22<>1,Cotizador!$I$87=6),\"X\",\"\"),\"\")","v":""},"6 cuotas (TCEA 12.0%)"]
[]
[null,null,null,null,null,null,null,null,{"$f":"IF($H$236=\"X\",IF(AND(Cotizador!$AD$22<>1,Cotizador!$I$87=10),\"X\",\"\"),\"\")","v":""},"10 cuotas  sin intereses",null,null,null,null,null,null,null,null,{"$f":"IF($R$236=\"X\",IF(AND(Cotizador!$AD$22<>1,Cotizador!$I$87=10),\"X\",\"\"),\"\")","v":""},"10 cuotas (TCEA 12.0%)"]
[]
[null,null,null,null,null,null,null,null,{"$f":"IF($H$236=\"X\",IF(AND(Cotizador!$AD$22<>1,Cotizador!$I$87=12),\"X\",\"\"),\"\")","v":""},"12 cuotas  sin intereses",null,null,null,null,null,null,null,null,{"$f":"IF($R$236=\"X\",IF(AND(Cotizador!$AD$22<>1,Cotizador!$I$87=12),\"X\",\"\"),\"\")","v":""}]
[]
[]
[null,null,"*Según cuota mínima del producto."]
[]
[]
[null,null,"Datos de asesor de venta"]
[]
[null,null,"Corredor",null,null,null,null,{"$f":"IF(LEN(Solicitud.Manual!$D$148)=0,\"\",Solicitud.Manual!$D$148)","v":""},null,null,null,null,null,null,null,"Código o Número",null,null,null,null,{"$f":"IF(LEN(Solicitud.Manual!$J$144)=0,\"\",Solicitud.Manual!$J$144)","v":""}]
[null,null,"Teléfono",null,{"$f":"IF(LEN(Solicitud.Manual!$J$146)=0,\"\",Solicitud.Manual!$J$146)","v":""},null,null,null,null,null,null,null,"Correo electrónico",null,null,null,{"$f":"IF(LEN(Solicitud.Manual!$J$148)=0,\"\",Solicitud.Manual!$J$148)","v":""}]
[]
[]
[]
[]
[]
[null,null,"Firma del Corredor"]
[]
[]
[null,null,"Declaracion del asegurado"]
[]
[null,null,"DECLARO que:"]
[]
[null,null,"1. Conozco que la veracidad y exactitud de la informacion aquí consignada es esencial para la determinacion de la prima, la cobertura y la decision final de PACIFICO SEGUROS para asegurar el riesgo analizado."]
[null,null,"2. Conozco que la reticencia y/o declaracion inexacta, hecha don dolo o culpa inexcusable(negligencia grave), en llenado de la presente solicitud, genera la nulidad del contrato de seguro."]
[null,null,"3. Conozco que constituye retinencia y/o declaracion inexacta con culpa inexcusable(negligencia grave) o dolo, según el caso, por ejemplo, ocultar o no develar informacion relevante y que era de mi conocimiento al momento de realizarse la inspeccion al riesgo asegurado, omitir dar informacion a PACIFICO SEGUROS al momento de contratar la poliza; y dejar espacios en blanco en la solicitud de seguro."]
[null,null,"4. Conozco que tengo la obligacion de notificar por escrito a PACIFICO SEGUROS los hechos o circunstancias que agraven el riesgo y conozco tambien que esta obligacion se extiende durante la vigencia del Contrato de Seguro; asimismo, en la vigencias de polizas que se negocien sucesiva e ininterrupidamente."]
[null,null,"5. Conozco que tengo la obligacion de informar a PACIFICO SEGUROS sobre cualquier evento o circunstancia que directa o indirectamente pueda ser pertinente para corregir, actualizar y/o complementar la informacion brindada en la solicitud de seguro. Si no actualizo la informacion nuevo que directa o indirectamente sea relevante para corregir, actualizar y/o complementar dicha informacion."]
[null,null,"6. Conozco que estoy facultado para plantear ante la COMPAÑÍA todas las consultas y/o dudas que pueda tener respecto del contenido de la Solicitud de Seguro que consta en el presente documento"]
[null,null,"7. He tenido mi disposicion de manera previa a la contratacion de este seguro las condiciones generales, condiciones particulares, condiciones especiales y demas informacion del seguro que solicito."]
[]
[null,"IMPORTANTE"]
[null,null,"Aprobación de la solicitud de seguro",null,null,null,null,null,null,null,null,null,null,null,"AUTORIZACIONES PARA USOS ADICIONALES"]
[null,null,"PACÍFICO SEGUROS entregará la póliza de seguro al Contratante dentro del plazo de 15 días calendario de haber recibido la solicitud, si es que no es rechazada.\nNo obstante, cuando corresponda, PACÍFICO SEGUROS se obliga a comunicar el rechazo de la solicitud dentro del plazo de 15 días calendario de recibida, salvo que PACÍFICO SEGUROS haya requerido información adicional y/u otros requerimientos adicionales, necesarios para la evaluación del riesgo, dentro del referido plazo. En este caso, el plazo para comunicar el rechazo se contará a partir de la recepción de la información completa solicitada y de cumplidos los requerimientos realizados por PACÍFICO SEGUROS. En el supuesto que el Contratante no complete la información solicitada por PACÍFICO SEGUROS y/o no cumpla con los requerimientos que PACÍFICO SEGUROS haya realizado, se considerará rechazada la solicitud."]
[null,null,null,null,null,null,null,null,null,null,null,null,null,null,"EL CLIENTE autoriza que PACÍFICO SEGUROS, de manera directa o a través de sus Encargados:\n- Le oferte cualquiera de nuestros productos de los ramos de Riesgos Generales o de Vida.\n- Le oferte cualquier otro producto o servicio de PACÍFICO SEGUROS o de sus empresas terceras.\n- A transferir su Información a empresas Credicorp (incluyendo subsidiarias, vinculadas y afiliadas) así como socios comerciales (Terceros), para que cada uno de ellos pueda ofertar sus productos o servicios. \n"]
[]
[]
[]
[]
[]
[]
[]
[]
[]
[]
[null,null,"Medios de comunicación pactados:",null,null,null,null,null,null,null,null,null,null,null,"Comisión de Comercialización: Hasta 20.00%\n"]
[null,null,"Autorizo a PACIFICO SEGUROS, a que en el caso de aprobar la presente solicitud, pueda enviar válidamente cualquier comunicación y/o notificación vinculada con este seguro durante su vigencia por cualquiera de los medios de comunicación arriba indicados. Declaro igualmente conocer y estar de acuerdo con que las comunicaciones y/o notificaciones que sean dirigidas a mi correo electrónico surtirán efectos y las consideraré recibidas a partir del momento en que éstas sean recibidas en el servidor de mi cuenta del correo electrónico, considerándose igualmente que en ese momento he tomado conocimiento del contenido del documento enviado por dicho medio.",null,null,null,null,null,null,null,null,null,null,null,"Vigencia de la póliza: Anual"]
[]
[]
[]
[]
[null,null,null,null,null,null,null,null,null,null,null,null,null,null,"EL CLIENTE acepta haber tenido a su disposición la lista de Terceros y Encargados que también se encuentra disponible en https://www.pacifico.com.pe/transparencia/politica-privacidad. Dicha lista detalla los posibles usos que los Terceros darán a sus datos personales. El envío de comunicaciones o mensajes con las ofertas y/o publicidades podrá ser remitida a través de medios escritos, verbales (por ejemplo: mensajes, push notification o llamadas telefónicas) o electrónicos/informáticos (por ejemplo correo electrónico)."]
[]
[]
[]
[null,null,"Se enviará comunicaciones por escrito al domicilio físico del contratante y/o asegurado, en caso la normatividad vigente lo exija o, no se consigne una dirección electrónica."]
[]
[]
[null,null,"PROTECCIÓN DE DATOS PERSONALES"]
[]
[null,null,"Para la correcta ejecución de la relación contractual, EL CONTRATANTE / ASEGURADO (“EL CLIENTE”) se obliga a mantener actualizada su información personal, financiera y crediticia (“LA INFORMACIÓN”) y reconoce que PACÍFICO SEGUROS podrá tratarla, actualizarla, completarla y realizar flujos transfronterizos conforme a ley."]
[]
[]
[]
[]
[]
[]
[null,null,"PACÍFICO SEGUROS conservará, tratará y realizará flujos transfronterizos con LA INFORMACIÓN de EL CLIENTE mientras se mantenga la relación contractual y luego de veinte (20) años de finalizado el contrato.\nPara el tratamiento de La INFORMACIÓN de EL CLIENTE, PACÍFICO SEGUROS utilizará diversos Encargados ubicados en el Perú y el extranjero, los cuales se han puesto a disposición del El cliente y también se encuentran detallados en https://www.pacifico.com.pe/transparencia/politica-privacidad.",null,null,null,null,null,null,null,null,null,null,null,"PACÍFICO SEGUROS y los Terceros podrán conservar y tratar LA INFORMACIÓN de EL CLIENTE en los términos establecidos en esta sección, mientras se mantenga la relación contractual y luego de veinte (20) años de finalizado el contrato.\nLa aceptación o no de esta autorización para usos adicionales (ajenos a la ejecución de la relación contractual) no condiciona la prestación del servicio que EL CLIENTE está contratando.\n"]
[]
[]
[]
[]
[]
[]
[]
[]
[]
[]
[]
[]
[null,null,null,null,null,null,null,null,null,null,null,null,null,null,"Sí acepto",null,null,null,null,null,null,null,null,null,null,null,null,{"$f":"IF(LEN(Solicitud.Manual!$E$109)=0,\"\",Solicitud.Manual!$E$109)","v":""}]
[null,null,null,null,null,null,null,null,null,null,null,null,null,null,"No acepto y"]
[null,null," Su información será incluida en el banco de datos de Usuarios que se encuentra registrado ante la Autoridad de Protección de Datos Personales bajo el número de registro RNPDP-PJ N.° 774, de titularidad de PACÍFICO SEGUROS, ubicada en Juan de Arona 830, San Isidro, Lima - Perú.",null,null,null,null,null,null,null,null,null,null,null,"prefiero perder la oportunidad de recibir nuevas ofertas",null,null,null,null,null,null,null,null,null,null,null,null,{"$f":"IF(LEN(Solicitud.Manual!$E$111)=0,\"\",Solicitud.Manual!$E$111)","v":""}]
[]
[]
[]
[]
[null,null,null,null,null,null,null,null,null,null,null,null,null,null,"Cláusulas Abusivas"]
[null,null,null,null,null,null,null,null,null,null,null,null,null,null,"“Las condiciones de la presente póliza se encuentran sujetas a una revisión posterior por parte de la Superintendencia de Banca, Seguros y AFPs, por lo que, en caso se identiﬁquen cláusulas abusivas en el marco de la Ley del Contrato de Seguro y normas reglamentarias, y estas no sean subsanadas por PACÍFICO SEGUROS, la Superintendencia de Banca, Seguros y AFPs,"]
[]
[]
[]
[null,null,"EL CLIENTE puede ejercer los derechos de acceso, rectificación, cancelación, revocación y oposición, dirigiéndose a PACÍFICO SEGUROS de forma presencial en cualquiera de sus oficinas a nivel nacional en el horario establecido para la atención al público o por teléfono o a través del Chat ubicado en nuestra página web www.pacifico.com.pe.\nEl detalle de nuestra Política de Privacidad se encuentra disponible en: \nhttps://www.pacifico.com.pe/transparencia/politica-privacidad"]
[]
[]
[]
[]
[]
[null,null,null,null,null,null,null,null,null,null,null,null,null,null,"Derecho de arrepentimiento"]
[null,null,null,null,null,null,null,null,null,null,null,null,null,null,"En el caso que este seguro sea ofertado por un comercializador (incluyendo la bancaseguro), declaro conocer que tengo derecho a arrepentirme de la contratación de este seguro, sin expresión de causa ni penalidad alguna, dentro del plazo de 15 días de recibir la póliza de seguro o el certificado de seguro, de ser el caso, y a que se me devuelva la prima que hubiere pagado."]
[]
[]
[]
[]
[]
[]
[]
[]
[]
[]
[]
[]
[null,null,null,null,null,null,null,null,null,null,null,null,null,null,null,null,null,null,null,null,null,null,null,null,null,null,null,"Fecha",null,{"$f":"DAY(Cotizador!$I$88)","v":0},{"$f":"MONTH(Cotizador!$I$88)","v":1},{"$f":"YEAR(Cotizador!$I$88)","v":1900}]
[null,null,null,null,"Firma del Asegurado",null,null,null,null,null,null,null,null,null,null,null,null,null,null,null,null,null,null,null,null,null,null,null,null,"día","mes","año"]

{"sheet":"PagodePrimasLocal1","index":8,"n_rows":48,"n_cols":40,"rows_kept":48,"cut":false,"hidden":false,"merged":[[1,8,2,12],[21,7,22,7],[7,8,7,9],[7,12,7,14],[9,12,9,14],[10,12,10,14],[11,12,11,14],[12,12,12,14]]}
[null,null,null,null,null,null,null,null,null,null,null,null,null,null,null,null,null,null,null,null,null,null,null,null,null,null,null,null,null,null,null,null,null,null,null,null,null,null,{"$f":"IFERROR(IF(OR(K22=4,K22=12),AM5*VLOOKUP(K22,AD35:AF40,3,0),AM5*SUMPRODUCT(($AD$35:$AD$40=K22)*($AE$35:$AE$40=I17)*($AF$35:$AF$40))),0)","v":0},"<- Fórmula anterior…"]
[]
[]
[]
[null,null,null,null,null,null,null,null,null,null,null,null,null,null,null,null,null,null,null,null,null,null,null,null,null,null,1,"SÍ","Pago contado","Incendio",2.1488271999999999,{"$f":"IF(ISERROR($AE$10*AE5),0,$AE$10*AE5)/1000","v":0},{"$f":"+IF($AE$10>50000,AF5,75)*AE21","v":0},{"$f":"+AG5/(1+$AE$14)","v":0},null,{"$f":"IF(LEN(I10)>0,1,0)+IF(LEN(M8)>0,1,0)+IF(LEN(M10)>0,1,0)+IF(LEN(M11)>0,1,0)+IF(LEN(M12)>0,1,0)+IF(LEN(M13)>0,1,0)+IF(LEN(M17)>0,1,0)+IF(LEN(N22)>0,1,0)","v":1},null,"Accidentes",{"$f":"IF(Cotizador!$F$44=\"SÍ\",ACCO!$E$66,\"\")","v":""},{"$f":"IFERROR(AM5/(1+$AE$14),0)","v":0}]
[null,null,null,null,null,null,"Canal",null,null,null,null,null,null,null,null,null,null,null,null,null,null,null,null,null,null,null,2,"NO","En cuotas","Roma",0.2892652,{"$f":"IF(CoberturasaElegirLocal1!M23=\"\",0,IF(ISERROR($AE$10*AE6),0,($AE$10*AE6)))/1000","v":0},{"$f":"+IF(AF6=0,0,IF($AE$10>50000,AF6,25))*AE21","v":0},{"$f":"+AG6/(1+$AE$14)","v":0},null,null,null,null,{"$f":"IFERROR(IF(OR(K22=12),AM5*VLOOKUP(K22,AD35:AF40,3,0),AM5*SUMPRODUCT(($AD$35:$AD$40=K22)*($AE$35:$AE$40=I17)*($AF$35:$AF$40))),0)","v":0},"<- Fórmula modificada el 06 Mayo 2017"]
[null,null,null,null,null,null,null,null,null,null,null,null,null,null,null,null,null,null,null,null,null,null,null,null,null,null,null,null,null,"Eqel",0.2169489,{"$f":"IF(CoberturasaElegirLocal1!M26=\"\",0,IF(ISERROR($AE$10*AE7),0,($AE$10*AE7)))/1000","v":0},{"$f":"+IF(AF7=0,0,IF($AE$10>50000,AF7,25))*AE21","v":0},{"$f":"+AG7/(1+$AE$14)","v":0},null,null,null,null,{"$f":"IFERROR(IF(K22=4,AM5,(AM6*K22)),0)","v":0},"<- Fórmula modificada el 12 Mayo 2017 y el 18 Mayo 2017"]
[null,null,null,null,null,null,null,"Tipo Canal:",{"$f":"IF(Solicitud.Manual!$J$142=0,\"\",Solicitud.Manual!$J$142)","v":"Corredores"},null,null,"Nombre Canal:",{"$f":"IF(Solicitud.Manual!$J$142=0,\"\",Solicitud.Manual!$J$142)","v":"Corredores"},null,null,null,null,null,null,null,null,null,null,null,null,null,null,null,null,"Robo",0.73774477999999999,{"$f":"IF(CoberturasaElegirLocal1!AB7=0,0,IF(ISERROR($AE$10*AE8),0,($AE$10*AE8)))/1000","v":0},{"$f":"+IF(AF8=0,0,IF($AE$10>50000,AF8,75))*AE21","v":0},{"$f":"+AG8/(1+$AE$14)","v":0}]
[null,null,null,null,null,null,null,null,null,null,null,null,null,null,null,null,null,null,null,null,null,null,null,null,null,null,null,null,null,"Resp",{"$f":"IF(Cotizador!$H$17=\"\",0,CoberturasaElegirLocal1!$N$40)","v":0},{"$f":"IF(DatosdelNegocioLocal1!$I$8=\"HOTELES Y HOSPEDAJES (DE 2 Y 3 ESTRELLAS)\",IF(AE9=50000,99,IF(AE9=100000,197,IF(AE9=200000,394,IF(AE9=300000,591,IF(AE9=500000,985,0))))),IF(AE9=50000,45,IF(AE9=100000,91,IF(AE9=200000,181,IF(AE9=300000,272,IF(AE9=500000,453,0))))))","v":0},{"$f":"+AF9*AE21","v":0},{"$f":"+AG9/(1+$AE$14)","v":0}]
[null,null,null,null,null,null,null,"Código o Número:",{"$f":"IF(Solicitud.Manual!$J$144=0,\"\",Solicitud.Manual!$J$144)","v":""},null,null,"Nombre Corredorr:",{"$f":"IF(Solicitud.Manual!$D$148=0,\"\",Solicitud.Manual!$D$148)","v":""},null,null,null,null,null,null,null,null,null,null,null,null,null,null,null,null,"VD",{"$f":"+CoberturasaElegirLocal1!M18","v":""},null,{"$f":"SUM(AG5:AG9)","v":0},{"$f":"SUM(AH5:AH9)","v":0},{"$f":"AG10","v":0},null,null,"Transportes",{"$f":"IF(Cotizador!$F$46=\"SÍ\",IF(LEN(CuestionarioTransporte!$D$26)>0,CuestionarioTransporte!$D$26,\"\"),\"\")","v":""},{"$f":"IFERROR(AM10/(1+$AE$14),0)","v":0}]
[null,null,null,null,null,null,null,null,null,null,null,"DNI Vendedor:",null,null,null,null,null,null,null,null,null,null,null,null,null,null,null,null,null,null,null,null,{"$f":"IF($AF$33=\"RUC\",IF(OR(K22=4,K22=12),AG10*VLOOKUP(K22,AD35:AG40,4,0),AG10*SUMPRODUCT(($AD$35:$AD$40=K22)*($AE$35:$AE$40=I17)*($AG$35:$AG$40))),IF(OR(K22=4,K22=12),AG10*VLOOKUP(K22,AD35:AF40,3,0),AG10*SUMPRODUCT(($AD$35:$AD$40=K22)*($AE$35:$AE$40=I17)*($AF$35:$AF$40))))","v":0},null,null,null,null,null,{"$f":"IF(K22=4,0,IFERROR(IF(OR(K22=4,K22=12),AM10*VLOOKUP(K22,AD35:AF40,3,0),AM10*SUMPRODUCT(($AD$35:$AD$40=K22)*($AE$35:$AE$40=I17)*($AF$35:$AF$40))),0))","v":0}]
[null,null,null,null,null,null,null,null,null,null,null,"Teléfono Vendedor:",{"$f":"IF(Solicitud.Manual!$J$146=0,\"\",Solicitud.Manual!$J$146)","v":""},null,null,null,null,null,null,null,null,null,null,null,null,null,null,null,null,"Forma de pago",null,null,{"$f":"IF(ISERROR(AG11*K22),0,(AG11*K22))","v":0},null,null,null,null,null,{"$f":"SUM(AM10:AM11)","v":0}]
[null,null,null,null,null,null,null,null,null,null,null,"Correo electrónico:",{"$f":"IF(Solicitud.Manual!$J$148=0,\"\",Solicitud.Manual!$J$148)","v":""},null,null,null,null,null,null,null,null,null,null,null,null,null,null,null,null,{"$f":"IF(LEN(Cotizador!$E$82)=0,\"\",Cotizador!$E$82)","v":""}]
[null,null,null,null,null,null,null,null,null,null,null,null,null,null,null,null,null,null,null,null,null,null,null,null,null,null,null,null,null,"IGV",0.18,"Ptasa","Pcliente","Pcomercial"]
[null,null,null,null,null,null,"Autorizaciones",null,null,null,null,null,null,null,null,null,null,null,null,null,null,null,null,null,null,null,null,null,null,2,{"$f":"IF(LEN(I8)>0,1,0)+IF(LEN(M8)>0,1,0)+IF(LEN(M10)>0,1,0)+IF(LEN(I10)>0,1,0)+IF(LEN(AE42)>0,1,0)+IF(LEN(M17)>0,1,0)+IF(LEN(N22)>0,1,0)+IF(LEN(I22)>0,1,0)+IF(LEN(K22)>0,1,0)+IF(LEN(M11)>0,1,0)+IF(LEN(M12)>0,1,0)+IF(LEN(M13)>0,1,0)","v":4}]
[null,null,null,null,null,null,null,null,null,null,null,null,null,null,null,null,null,null,null,null,null,null,null,null,null,null,null,null,1,"Corredores",{"$f":"+IF(AD21=2,\"\",\"Sin Cuotas\")","v":""},null,null,"FFVV"]
[null,null,null,null,null,null,null,"Forma de pago",{"$f":"IF(Cotizador!$E$82=0,\"\",Cotizador!$E$82)","v":""},null,null,"Emitir Factura?",{"$f":"IF(Cotizador!$I$82=0,\"\",Cotizador!$I$82)","v":""},null,null,null,null,null,null,null,null,null,null,null,null,null,null,null,2,"Fuerza de Ventas",null,{"$f":"+IF($AD$21=2,4,\"\")","v":4},null,{"$f":"+IF($AD$21=2,4,\"\")","v":4}]
[null,null,null,null,null,null,null,null,null,null,null,null,null,null,null,null,null,null,null,null,null,null,null,null,null,null,null,null,3,"Televentas",null,{"$f":"+IF($AD$21=2,6,\"\")","v":6},null,{"$f":"+IF($AD$21=2,6,\"\")","v":6}]
[null,null,null,null,null,null,null,null,null,null,null,null,null,null,null,null,null,null,null,null,null,null,null,null,null,null,null,null,null,null,null,{"$f":"+IF($AD$21=2,10,\"\")","v":10},null,{"$f":"+IF($AD$21=2,12,\"\")","v":12}]
[null,null,null,null,null,null,"Inicio de Vigencia y Pago",null,null,null,null,null,null,null,null,null,null,null,null,null,null,null,null,null,null,null,null,null,null,"Interes:",{"$f":"+AF27","v":1},{"$f":"+IF($AD$21=2,IF($AD$13=\"Cupones\",\"\",12),\"\")","v":12}]
[null,null,null,null,null,null,null,null,null,null,null,null,null,null,null,null,null,null,null,null,null,null,null,null,null,null,null,null,null,2,1]
[null,null,null,null,null,null,null,"Forma de Pago:","Al Contado","Nro. Cuotas:",{"$f":"IF(Cotizador!$I$87=0,\"\",Cotizador!$I$87)","v":""},null,"Inicio Vigencia Póliza:",{"$f":"IF(Cotizador!$I$88=0,\"\",Cotizador!$I$88)","v":""},null,null,null,null,null,null,null,null,null,null,null,null,null,null,null,{"$f":"IF(AND(CoberturasaElegirLocal1!M18>0,CoberturasaElegirLocal1!M18<=50000),\"PLAN PYME HASTA 50 MIL DÓLARES\",IF(AND(CoberturasaElegirLocal1!M18>50000,CoberturasaElegirLocal1!M18<=500000),\"PLAN PYME MAYOR A 50 MIL DÓLARES\",IF(CoberturasaElegirLocal1!M18>500000,\"PLAN PYME MAYOR A 500 MIL DÓLARES\",\"\")))","v":"PLAN PYME MAYOR A 500 MIL DÓLARES"}]
[null,null,null,null,null,null,null,null,"En cuotas"]
[null,null,null,null,null,null,null,null,null,null,null,null,null,null,null,null,null,null,null,null,null,null,null,null,null,null,null,null,null,"Al Contado",0,{"$f":"+IF(AE42=\"SÍ\",\"DA\",IF(AE42=\"NO\",\"C\",\"\"))","v":"C"}]
[null,null,null,null,null,null,null,null,null,"Monto Total a Pagar Anual:",{"$f":"+IF(AND(AD21=1,K22=\"\"),AG10,IF(K22=\"\",\"----\",AG12))","v":"----"},"USD",null,null,null,null,null,null,null,null,null,null,null,null,null,null,null,null,null,"En Cuotas4DA",0,{"$f":"+IF(AD21=1,\"Al Contado\",IF(AD21=2,\"En Cuotas\",\"\"))","v":"En Cuotas"}]
[null,null,null,null,null,null,null,null,null,"Monto Total a Pagar Mensual:",{"$f":"IF(ISERROR(IF(K22=\" \",\"---\",K25/K22)),0,IF(K22=\" \",\"---\",K25/K22))","v":0},"USD",null,null,null,null,null,null,null,null,null,null,null,null,null,null,null,null,null,"En Cuotas4C",0,{"$f":"+AF25&K22&AF24","v":"En CuotasC"}]
[null,null,null,null,null,null,null,null,null,null,null,null,null,null,null,null,null,null,null,null,null,null,null,null,null,null,null,null,null,"En Cuotas6DA",0.12,1]
[null,null,null,null,null,null,null,null,null,null,null,null,null,null,null,null,null,null,null,null,null,null,null,null,null,null,null,null,null,"En Cuotas6C",0.17499999999999999,1]
[null,null,null,null,null,null,null,null,null,null,null,null,null,null,null,null,null,null,null,null,null,null,null,null,null,null,null,null,null,"En Cuotas10DA",0.12,{"$f":"+IF(AE42=\"NO\",2,1)","v":2},"Débito"]
[null,null,null,null,null,null,null,null,null,null,null,null,null,null,null,null,null,null,null,null,null,null,null,null,null,null,null,null,null,"En Cuotas10C",0.17499999999999999,{"$f":"+IF(AE43=\"NO\",2,1)","v":2},"cupones"]
[null,null,null,null,null,null,null,null,null,null,null,null,null,null,null,null,null,null,null,null,null,null,null,null,null,null,null,null,null,"En Cuotas12DA",0.12]
[null,null,null,null,null,null,null,null,null,null,null,null,null,null,null,null,null,null,null,null,null,null,null,null,null,null,null,null,null,"En Cuotas12C",0.17499999999999999]
[null,null,null,null,null,null,null,null,null,null,null,null,null,null,null,null,null,null,null,null,null,null,null,null,null,null,null,null,null,null,"Dcto Contratante",{"$f":"Cotizador!$E$81","v":0}]
[null,null,null,null,null,null,null,null,null,null,null,null,null,null,null,null,null,null,null,null,null,null,null,null,null,null,null,null,null,null,null,"P.Natural","P.Juridica"]
[null,null,null,null,null,null,null,null,null,null,null,null,null,null,null,null,null,null,null,null,null,null,null,null,null,null,null,null,null,4,null,0.25,0.25]
[null,null,null,null,null,null,null,null,null,null,null,null,null,null,null,null,null,null,null,null,null,null,null,null,null,null,null,null,null,6,"Cupones",0.17464738217893,0.17224535521308482]
[null,null,null,null,null,null,null,null,null,null,null,null,null,null,null,null,null,null,null,null,null,null,null,null,null,null,null,null,null,10,"Cupones",0.10759130788909588,0.10529275549614135]
[]
[]
[]
[]
[null,null,null,null,null,null,null,null,null,null,null,null,null,null,null,null,null,null,null,null,null,null,null,null,null,null,null,null,null,"Débito Automático:",{"$f":"+IF($I$17=\"Débito Automático\",\"SÍ\",\"NO\")","v":"NO"}]
[null,null,null,null,null,null,null,null,null,null,null,null,null,null,null,null,null,null,null,null,null,null,null,null,null,null,null,null,null,"Cupones:",{"$f":"+IF($I$17=\"Cupones\",\"SÍ\",\"NO\")","v":"NO"}]
[]
[null,null,null,null,null,null,null,null,null,null,null,null,null,null,null,null,null,null,null,null,null,null,null,null,null,null,null,null,null,"Result",{"$f":"+IF(OR(K22=4,K22=12),VLOOKUP(K22,$AD$35:$AF$40,3,0),SUMPRODUCT(($AD$35:$AD$40=K22)*($AE$35:$AE$40=I17)*$AF$35:$AF$40))","v":0}]
[]
[null,null,null,null,null,null,null,null,null,null,null,null,null,null,null,null,null,null,null,null,null,null,null,null,null,null,null,null,null,1,"Débito Automático",2]
[null,null,null,null,null,null,null,null,null,null,null,null,null,null,null,null,null,null,null,null,null,null,null,null,null,null,null,null,null,2,"Cupones"]

{"sheet":"PagodePrimasLocal2","index":9,"n_rows":48,"n_cols":40,"rows_kept":48,"cut":false,"hidden":false,"merged":[[12,12,12,14],[21,7,22,7],[1,8,2,12],[7,8,7,9],[7,12,7,14],[9,12,9,14],[10,12,10,14],[11,12,11,14]]}
[]
[]
[]
[]
[null,null,null,null,null,null,null,null,null,null,null,null,null,null,null,null,null,null,null,null,null,null,null,null,null,null,1,"SÍ","Pago contado","Incendio",2.1488271999999999,{"$f":"IF(ISERROR($AE$10*AE5),0,$AE$10*AE5)/1000","v":0},{"$f":"+IF($AE$10>50000,AF5,75)*AE21","v":0},{"$f":"+AG5/(1+$AE$14)","v":0},null,{"$f":"IF(LEN(I10)>0,1,0)+IF(LEN(M8)>0,1,0)+IF(LEN(M10)>0,1,0)+IF(LEN(M11)>0,1,0)+IF(LEN(M12)>0,1,0)+IF(LEN(M13)>0,1,0)+IF(LEN(M17)>0,1,0)+IF(LEN(N22)>0,1,0)","v":1},null,"Accidentes",{"$f":"IF(Cotizador!$K$44=\"SÍ\",ACCO!$F$66,\"\")","v":""},{"$f":"IFERROR(AM5/(1+$AE$14),0)","v":0}]
[null,null,null,null,null,null,"Canal",null,null,null,null,null,null,null,null,null,null,null,null,null,null,null,null,null,null,null,2,"NO","En cuotas","Roma",0.2892652,{"$f":"IF(CoberturasaElegirLocal2!M23=\"\",0,IF(ISERROR($AE$10*AE6),0,($AE$10*AE6)))/1000","v":0},{"$f":"+IF(AF6=0,0,IF($AE$10>50000,AF6,25))*AE21","v":0},{"$f":"+AG6/(1+$AE$14)","v":0},null,null,null,null,{"$f":"IFERROR(IF(OR(K22=4,K22=12),AM5*VLOOKUP(K22,AD35:AF40,3,0),AM5*SUMPRODUCT(($AD$35:$AD$40=K22)*($AE$35:$AE$40=I17)*($AF$35:$AF$40))),0)","v":0}]
[null,null,null,null,null,null,null,null,null,null,null,null,null,null,null,null,null,null,null,null,null,null,null,null,null,null,null,null,null,"Eqel",0.2169489,{"$f":"IF(CoberturasaElegirLocal2!M26=\"\",0,IF(ISERROR($AE$10*AE7),0,($AE$10*AE7)))/1000","v":0},{"$f":"+IF(AF7=0,0,IF($AE$10>50000,AF7,25))*AE21","v":0},{"$f":"+AG7/(1+$AE$14)","v":0},null,null,null,null,{"$f":"SUM(AM5:AM6)","v":0}]
[null,null,null,null,null,null,null,"Tipo Canal:",{"$f":"IF(Solicitud.Manual!$J$142=0,\"\",Solicitud.Manual!$J$142)","v":"Corredores"},null,null,"Nombre Canal:",{"$f":"IF(Solicitud.Manual!$J$142=0,\"\",Solicitud.Manual!$J$142)","v":"Corredores"},null,null,null,null,null,null,null,null,null,null,null,null,null,null,null,null,"Robo",0.73774477999999999,{"$f":"IF(CoberturasaElegirLocal2!AB7=0,0,IF(ISERROR($AE$10*AE8),0,($AE$10*AE8)))/1000","v":0},{"$f":"+IF(AF8=0,0,IF($AE$10>50000,AF8,75))*AE21","v":0},{"$f":"+AG8/(1+$AE$14)","v":0},null,null,null,null,"<"]
[null,null,null,null,null,null,null,null,null,null,null,null,null,null,null,null,null,null,null,null,null,null,null,null,null,null,null,null,null,"Resp",{"$f":"IF(Cotizador!$M$17=\"\",0,CoberturasaElegirLocal2!$N$40)","v":0},{"$f":"IF(DatosdelNegocioLocal2!$I$8=\"HOTELES Y HOSPEDAJES (DE 2 Y 3 ESTRELLAS)\",IF(AE9=50000,99,IF(AE9=100000,197,IF(AE9=200000,394,IF(AE9=300000,591,IF(AE9=500000,985,0))))),IF(AE9=50000,45,IF(AE9=100000,91,IF(AE9=200000,181,IF(AE9=300000,272,IF(AE9=500000,453,0))))))","v":0},{"$f":"+AF9*AE21","v":0},{"$f":"+AG9/(1+$AE$14)","v":0}]
[null,null,null,null,null,null,null,"Código o Número:",{"$f":"IF(Solicitud.Manual!$J$144=0,\"\",Solicitud.Manual!$J$144)","v":""},null,null,"Nombre Corredorr:",{"$f":"IF(Solicitud.Manual!$D$148=0,\"\",Solicitud.Manual!$D$148)","v":""},null,null,null,null,null,null,null,null,null,null,null,null,null,null,null,null,"VD",{"$f":"+CoberturasaElegirLocal2!M18","v":""},null,{"$f":"SUM(AG5:AG9)","v":0},{"$f":"SUM(AH5:AH9)","v":0},null,null,null,"Transportes",null,{"$f":"+AM10/(1+$AE$14)","v":0}]
[null,null,null,null,null,null,null,null,null,null,null,"DNI Vendedor:",null,null,null,null,null,null,null,null,null,null,null,null,null,null,null,null,null,null,null,null,{"$f":"IF($AF$33=\"RUC\",IF(OR(K22=4,K22=12),AG10*VLOOKUP(K22,AD35:AG40,4,0),AG10*SUMPRODUCT(($AD$35:$AD$40=K22)*($AE$35:$AE$40=I17)*($AG$35:$AG$40))),IF(OR(K22=4,K22=12),AG10*VLOOKUP(K22,AD35:AF40,3,0),AG10*SUMPRODUCT(($AD$35:$AD$40=K22)*($AE$35:$AE$40=I17)*($AF$35:$AF$40))))","v":0}]
[null,null,null,null,null,null,null,null,null,null,null,"Teléfono Vendedor:",{"$f":"IF(Solicitud.Manual!$J$146=0,\"\",Solicitud.Manual!$J$146)","v":""},null,null,null,null,null,null,null,null,null,null,null,null,null,null,null,null,null,null,null,{"$f":"IF(ISERROR(AG11*K22),0,(AG11*K22))","v":0},null,null,null,null,null,{"$f":"SUM(AM10:AM11)","v":0}]
[null,null,null,null,null,null,null,null,null,null,null,"Correo electrónico:",{"$f":"IF(Solicitud.Manual!$J$148=0,\"\",Solicitud.Manual!$J$148)","v":""}]
[null,null,null,null,null,null,null,null,null,null,null,null,null,null,null,null,null,null,null,null,null,null,null,null,null,null,null,null,null,"IGV",0.18,"Ptasa","Pcliente","Pcomercial"]
[null,null,null,null,null,null,"Autorizaciones",null,null,null,null,null,null,null,null,null,null,null,null,null,null,null,null,null,null,null,null,null,null,2,{"$f":"IF(LEN(I8)>0,1,0)+IF(LEN(M8)>0,1,0)+IF(LEN(M10)>0,1,0)+IF(LEN(I10)>0,1,0)+IF(LEN(AE42)>0,1,0)+IF(LEN(M17)>0,1,0)+IF(LEN(N22)>0,1,0)+IF(LEN(I22)>0,1,0)+IF(LEN(K22)>0,1,0)+IF(LEN(M11)>0,1,0)+IF(LEN(M12)>0,1,0)+IF(LEN(M13)>0,1,0)","v":4}]
[null,null,null,null,null,null,null,null,null,null,null,null,null,null,null,null,null,null,null,null,null,null,null,null,null,null,null,null,1,"Corredores",{"$f":"+IF(AD21=2,\"\",\"Sin Cuotas\")","v":""}]
[null,null,null,null,null,null,null,"Forma de pago",{"$f":"IF(Cotizador!$E$82=0,\"\",Cotizador!$E$82)","v":""},null,null,"Emitir Factura?",{"$f":"IF(Cotizador!$I$82=0,\"\",Cotizador!$I$82)","v":""},null,null,null,null,null,null,null,null,null,null,null,null,null,null,null,2,"Fuerza de Ventas",null,{"$f":"+IF($AD$21=2,4,\"\")","v":4}]
[null,null,null,null,null,null,null,null,null,null,null,null,null,null,null,null,null,null,null,null,null,null,null,null,null,null,null,null,3,"Televentas",null,{"$f":"+IF($AD$21=2,6,\"\")","v":6}]
[null,null,null,null,null,null,null,null,null,null,null,null,null,null,null,null,null,null,null,null,null,null,null,null,null,null,null,null,null,null,null,{"$f":"+IF($AD$21=2,10,\"\")","v":10}]
[null,null,null,null,null,null,"Inicio de Vigencia y Pago",null,null,null,null,null,null,null,null,null,null,null,null,null,null,null,null,null,null,null,null,null,null,"Interes:",{"$f":"+AF27","v":1},{"$f":"+IF($AD$21=2,12,\"\")","v":12}]
[null,null,null,null,null,null,null,null,null,null,null,null,null,null,null,null,null,null,null,null,null,null,null,null,null,null,null,null,null,{"$f":"PagodePrimasLocal1!AD21","v":2},1]
[null,null,null,null,null,null,null,"Forma de Pago:","Al Contado","Nro. Cuotas:",{"$f":"IF(Cotizador!$I$87=0,\"\",Cotizador!$I$87)","v":""},null,"Inicio Vigencia Póliza:",{"$f":"IF(Cotizador!$I$88=0,\"\",Cotizador!$I$88)","v":""},null,null,null,null,null,null,null,null,null,null,null,null,null,null,null,{"$f":"IF(AND(CoberturasaElegirLocal2!M18>0,CoberturasaElegirLocal2!M18<=50000),\"PLAN PYME HASTA 50 MIL DÓLARES\",IF(AND(CoberturasaElegirLocal2!M18>50000,CoberturasaElegirLocal2!M18<=500000),\"PLAN PYME MAYOR A 50 MIL DÓLARES\",IF(CoberturasaElegirLocal2!M18>500000,\"PLAN PYME MAYOR A 500 MIL DÓLARES\",\"\")))","v":"PLAN PYME MAYOR A 500 MIL DÓLARES"}]
[null,null,null,null,null,null,null,null,"En cuotas"]
[null,null,null,null,null,null,null,null,null,null,null,null,null,null,null,null,null,null,null,null,null,null,null,null,null,null,null,null,null,"Al Contado",0,{"$f":"+IF(AE42=\"SÍ\",\"DA\",IF(AE42=\"NO\",\"C\",\"\"))","v":"C"}]
[null,null,null,null,null,null,null,null,null,"Monto Total a Pagar Anual:",{"$f":"+IF(AND(AD21=1,K22=\"\"),AG10,IF(K22=\"\",\"----\",AG12))","v":"----"},"USD",null,null,null,null,null,null,null,null,null,null,null,null,null,null,null,null,null,"En Cuotas4DA",0,{"$f":"+IF(AD21=1,\"Al Contado\",IF(AD21=2,\"En Cuotas\",\"\"))","v":"En Cuotas"}]
[null,null,null,null,null,null,null,null,null,"Monto Total a Pagar Mensual:",{"$f":"IF(ISERROR(IF(K22=\" \",\"---\",K25/K22)),0,IF(K22=\" \",\"---\",K25/K22))","v":0},"USD",null,null,null,null,null,null,null,null,null,null,null,null,null,null,null,null,null,"En Cuotas4C",0,{"$f":"+AF25&K22&AF24","v":"En CuotasC"}]
[null,null,null,null,null,null,null,null,null,null,null,null,null,null,null,null,null,null,null,null,null,null,null,null,null,null,null,null,null,"En Cuotas6DA",0.12,1]
[null,null,null,null,null,null,null,null,null,null,null,null,null,null,null,null,null,null,null,null,null,null,null,null,null,null,null,null,null,"En Cuotas6C",0.17499999999999999,1]
[null,null,null,null,null,null,null,null,null,null,null,null,null,null,null,null,null,null,null,null,null,null,null,null,null,null,null,null,null,"En Cuotas10DA",0.12,{"$f":"+IF(AE42=\"NO\",2,1)","v":2},"Débito"]
[null,null,null,null,null,null,null,null,null,null,null,null,null,null,null,null,null,null,null,null,null,null,null,null,null,null,null,null,null,"En Cuotas10C",0.17499999999999999,{"$f":"+IF(AE43=\"NO\",2,1)","v":2},"cupones"]
[null,null,null,null,null,null,null,null,null,null,null,null,null,null,null,null,null,null,null,null,null,null,null,null,null,null,null,null,null,"En Cuotas12DA",0.12]
[null,null,null,null,null,null,null,null,null,null,null,null,null,null,null,null,null,null,null,null,null,null,null,null,null,null,null,null,null,"En Cuotas12C",0.17499999999999999]
[null,null,null,null,null,null,null,null,null,null,null,null,null,null,null,null,null,null,null,null,null,null,null,null,null,null,null,null,null,null,"Dcto Contratante",{"$f":"Cotizador!$E$81","v":0}]
[null,null,null,null,null,null,null,null,null,null,null,null,null,null,null,null,null,null,null,null,null,null,null,null,null,null,null,null,null,null,null,"P.Natural","P.Juridica"]
[null,null,null,null,null,null,null,null,null,null,null,null,null,null,null,null,null,null,null,null,null,null,null,null,null,null,null,null,null,4,null,0.25,0.25]
[null,null,null,null,null,null,null,null,null,null,null,null,null,null,null,null,null,null,null,null,null,null,null,null,null,null,null,null,null,6,"Cupones",0.17464738217893,0.17224535521308482]
[null,null,null,null,null,null,null,null,null,null,null,null,null,null,null,null,null,null,null,null,null,null,null,null,null,null,null,null,null,10,"Cupones",0.10759130788909588,0.10529275549614135]
[]
[]
[]
[]
[null,null,null,null,null,null,null,null,null,null,null,null,null,null,null,null,null,null,null,null,null,null,null,null,null,null,null,null,null,"Débito Automático:",{"$f":"+IF($I$17=\"Débito Automático\",\"SÍ\",\"NO\")","v":"NO"}]
[null,null,null,null,null,null,null,null,null,null,null,null,null,null,null,null,null,null,null,null,null,null,null,null,null,null,null,null,null,"Cupones:",{"$f":"+IF($I$17=\"Cupones\",\"SÍ\",\"NO\")","v":"NO"}]
[]
[null,null,null,null,null,null,null,null,null,null,null,null,null,null,null,null,null,null,null,null,null,null,null,null,null,null,null,null,null,"Result",{"$f":"+IF(OR(K22=4,K22=12),VLOOKUP(K22,$AD$35:$AF$40,3,0),SUMPRODUCT(($AD$35:$AD$40=K22)*($AE$35:$AE$40=I17)*$AF$35:$AF$40))","v":0}]
[]
[null,null,null,null,null,null,null,null,null,null,null,null,null,null,null,null,null,null,null,null,null,null,null,null,null,null,null,null,null,1,"Débito Automático",2]
[null,null,null,null,null,null,null,null,null,null,null,null,null,null,null,null,null,null,null,null,null,null,null,null,null,null,null,null,null,2,"Cupones"]

{"sheet":"PagodePrimasLocal3","index":10,"n_rows":48,"n_cols":40,"rows_kept":48,"cut":false,"hidden":false,"merged":[[12,12,12,14],[21,7,22,7],[1,8,2,12],[7,8,7,9],[7,12,7,14],[9,12,9,14],[10,12,10,14],[11,12,11,14]]}
[]
[]
[]
[]
[null,null,null,null,null,null,null,null,null,null,null,null,null,null,null,null,null,null,null,null,null,null,null,null,null,null,1,"SÍ","Pago contado","Incendio",2.1488271999999999,{"$f":"IF(ISERROR($AE$10*AE5),0,$AE$10*AE5)/1000","v":0},{"$f":"+IF($AE$10>50000,AF5,75)*AE21","v":0},{"$f":"+AG5/(1+$AE$14)","v":0},null,{"$f":"IF(LEN(I10)>0,1,0)+IF(LEN(M8)>0,1,0)+IF(LEN(M10)>0,1,0)+IF(LEN(M11)>0,1,0)+IF(LEN(M12)>0,1,0)+IF(LEN(M13)>0,1,0)+IF(LEN(M17)>0,1,0)+IF(LEN(N22)>0,1,0)","v":1},null,"Accidentes",{"$f":"IF(Cotizador!$P$44=\"SÍ\",ACCO!$G$66,\"\")","v":""},{"$f":"IFERROR(AM5/(1+$AE$14),0)","v":0}]
[null,null,null,null,null,null,"Canal",null,null,null,null,null,null,null,null,null,null,null,null,null,null,null,null,null,null,null,2,"NO","En cuotas","Roma",0.2892652,{"$f":"IF(CoberturasaElegirLocal3!M23=\"\",0,IF(ISERROR($AE$10*AE6),0,($AE$10*AE6)))/1000","v":0},{"$f":"+IF(AF6=0,0,IF($AE$10>50000,AF6,25))*AE21","v":0},{"$f":"+AG6/(1+$AE$14)","v":0},null,null,null,null,{"$f":"IFERROR(IF(OR(K22=4,K22=12),AM5*VLOOKUP(K22,AD35:AF40,3,0),AM5*SUMPRODUCT(($AD$35:$AD$40=K22)*($AE$35:$AE$40=I17)*($AF$35:$AF$40))),0)","v":0}]
[null,null,null,null,null,null,null,null,null,null,null,null,null,null,null,null,null,null,null,null,null,null,null,null,null,null,null,null,null,"Eqel",0.2169489,{"$f":"IF(CoberturasaElegirLocal3!M26=\"\",0,IF(ISERROR($AE$10*AE7),0,($AE$10*AE7)))/1000","v":0},{"$f":"+IF(AF7=0,0,IF($AE$10>50000,AF7,25))*AE21","v":0},{"$f":"+AG7/(1+$AE$14)","v":0},null,null,null,null,{"$f":"SUM(AM5:AM6)","v":0}]
[null,null,null,null,null,null,null,"Tipo Canal:",{"$f":"IF(Solicitud.Manual!$J$142=0,\"\",Solicitud.Manual!$J$142)","v":"Corredores"},null,null,"Nombre Canal:",{"$f":"IF(Solicitud.Manual!$J$142=0,\"\",Solicitud.Manual!$J$142)","v":"Corredores"},null,null,null,null,null,null,null,null,null,null,null,null,null,null,null,null,"Robo",0.73774477999999999,{"$f":"IF(CoberturasaElegirLocal3!AB7=0,0,IF(ISERROR($AE$10*AE8),0,($AE$10*AE8)))/1000","v":0},{"$f":"+IF(AF8=0,0,IF($AE$10>50000,AF8,75))*AE21","v":0},{"$f":"+AG8/(1+$AE$14)","v":0},null,null,null,null,"<"]
[null,null,null,null,null,null,null,null,null,null,null,null,null,null,null,null,null,null,null,null,null,null,null,null,null,null,null,null,null,"Resp",{"$f":"IF(Cotizador!$R$17=\"\",0,CoberturasaElegirLocal3!$N$40)","v":0},{"$f":"IF(DatosdelNegocioLocal3!$I$8=\"HOTELES Y HOSPEDAJES (DE 2 Y 3 ESTRELLAS)\",IF(AE9=50000,99,IF(AE9=100000,197,IF(AE9=200000,394,IF(AE9=300000,591,IF(AE9=500000,985,0))))),IF(AE9=50000,45,IF(AE9=100000,91,IF(AE9=200000,181,IF(AE9=300000,272,IF(AE9=500000,453,0))))))","v":0},{"$f":"+AF9*AE21","v":0},{"$f":"+AG9/(1+$AE$14)","v":0}]
[null,null,null,null,null,null,null,"Código o Número:",{"$f":"IF(Solicitud.Manual!$J$144=0,\"\",Solicitud.Manual!$J$144)","v":""},null,null,"Nombre Corredorr:",{"$f":"IF(Solicitud.Manual!$D$148=0,\"\",Solicitud.Manual!$D$148)","v":""},null,null,null,null,null,null,null,null,null,null,null,null,null,null,null,null,"VD",{"$f":"+CoberturasaElegirLocal3!M18","v":""},null,{"$f":"SUM(AG5:AG9)","v":0},{"$f":"SUM(AH5:AH9)","v":0},null,null,null,"Transportes",null,{"$f":"+AM10/(1+$AE$14)","v":0}]
[null,null,null,null,null,null,null,null,null,null,null,"DNI Vendedor:",null,null,null,null,null,null,null,null,null,null,null,null,null,null,null,null,null,null,null,null,{"$f":"IF($AF$33=\"RUC\",IF(OR(K22=4,K22=12),AG10*VLOOKUP(K22,AD35:AG40,4,0),AG10*SUMPRODUCT(($AD$35:$AD$40=K22)*($AE$35:$AE$40=I17)*($AG$35:$AG$40))),IF(OR(K22=4,K22=12),AG10*VLOOKUP(K22,AD35:AF40,3,0),AG10*SUMPRODUCT(($AD$35:$AD$40=K22)*($AE$35:$AE$40=I17)*($AF$35:$AF$40))))","v":0}]
[null,null,null,null,null,null,null,null,null,null,null,"Teléfono Vendedor:",{"$f":"IF(Solicitud.Manual!$J$146=0,\"\",Solicitud.Manual!$J$146)","v":""},null,null,null,null,null,null,null,null,null,null,null,null,null,null,null,null,null,null,null,{"$f":"IF(ISERROR(AG11*K22),0,(AG11*K22))","v":0},null,null,null,null,null,{"$f":"SUM(AM10:AM11)","v":0}]
[null,null,null,null,null,null,null,null,null,null,null,"Correo electrónico:",{"$f":"IF(Solicitud.Manual!$J$148=0,\"\",Solicitud.Manual!$J$148)","v":""}]
[null,null,null,null,null,null,null,null,null,null,null,null,null,null,null,null,null,null,null,null,null,null,null,null,null,null,null,null,null,"IGV",0.18,"Ptasa","Pcliente","Pcomercial"]
[null,null,null,null,null,null,"Autorizaciones",null,null,null,null,null,null,null,null,null,null,null,null,null,null,null,null,null,null,null,null,null,null,2,{"$f":"IF(LEN(I8)>0,1,0)+IF(LEN(M8)>0,1,0)+IF(LEN(M10)>0,1,0)+IF(LEN(I10)>0,1,0)+IF(LEN(AE42)>0,1,0)+IF(LEN(M17)>0,1,0)+IF(LEN(N22)>0,1,0)+IF(LEN(I22)>0,1,0)+IF(LEN(K22)>0,1,0)+IF(LEN(M11)>0,1,0)+IF(LEN(M12)>0,1,0)+IF(LEN(M13)>0,1,0)","v":4}]
[null,null,null,null,null,null,null,null,null,null,null,null,null,null,null,null,null,null,null,null,null,null,null,null,null,null,null,null,1,"Corredores",{"$f":"+IF(AD21=2,\"\",\"Sin Cuotas\")","v":""}]
[null,null,null,null,null,null,null,"Forma de pago",{"$f":"IF(Cotizador!$E$82=0,\"\",Cotizador!$E$82)","v":""},null,null,"Emitir Factura?",{"$f":"IF(Cotizador!$I$82=0,\"\",Cotizador!$I$82)","v":""},null,null,null,null,null,null,null,null,null,null,null,null,null,null,null,2,"Fuerza de Ventas",null,{"$f":"+IF($AD$21=2,4,\"\")","v":4}]
[null,null,null,null,null,null,null,null,null,null,null,null,null,null,null,null,null,null,null,null,null,null,null,null,null,null,null,null,3,"Televentas",null,{"$f":"+IF($AD$21=2,6,\"\")","v":6}]
[null,null,null,null,null,null,null,null,null,null,null,null,null,null,null,null,null,null,null,null,null,null,null,null,null,null,null,null,null,null,null,{"$f":"+IF($AD$21=2,10,\"\")","v":10}]
[null,null,null,null,null,null,"Inicio de Vigencia y Pago",null,null,null,null,null,null,null,null,null,null,null,null,null,null,null,null,null,null,null,null,null,null,"Interes:",{"$f":"+AF27","v":1},{"$f":"+IF($AD$21=2,12,\"\")","v":12}]
[null,null,null,null,null,null,null,null,null,null,null,null,null,null,null,null,null,null,null,null,null,null,null,null,null,null,null,null,null,{"$f":"PagodePrimasLocal1!AD21","v":2},1]
[null,null,null,null,null,null,null,"Forma de Pago:","Al Contado","Nro. Cuotas:",{"$f":"IF(Cotizador!$I$87=0,\"\",Cotizador!$I$87)","v":""},null,"Inicio Vigencia Póliza:",{"$f":"IF(Cotizador!$I$88=0,\"\",Cotizador!$I$88)","v":""},null,null,null,null,null,null,null,null,null,null,null,null,null,null,null,{"$f":"IF(AND(CoberturasaElegirLocal3!M18>0,CoberturasaElegirLocal3!M18<=50000),\"PLAN PYME HASTA 50 MIL DÓLARES\",IF(AND(CoberturasaElegirLocal3!M18>50000,CoberturasaElegirLocal3!M18<=500000),\"PLAN PYME MAYOR A 50 MIL DÓLARES\",IF(CoberturasaElegirLocal3!M18>500000,\"PLAN PYME MAYOR A 500 MIL DÓLARES\",\"\")))","v":"PLAN PYME MAYOR A 500 MIL DÓLARES"}]
[null,null,null,null,null,null,null,null,"En cuotas"]
[null,null,null,null,null,null,null,null,null,null,null,null,null,null,null,null,null,null,null,null,null,null,null,null,null,null,null,null,null,"Al Contado",0,{"$f":"+IF(AE42=\"SÍ\",\"DA\",IF(AE42=\"NO\",\"C\",\"\"))","v":"C"}]
[null,null,null,null,null,null,null,null,null,"Monto Total a Pagar Anual:",{"$f":"+IF(AND(AD21=1,K22=\"\"),AG10,IF(K22=\"\",\"----\",AG12))","v":"----"},"USD",null,null,null,null,null,null,null,null,null,null,null,null,null,null,null,null,null,"En Cuotas4DA",0,{"$f":"+IF(AD21=1,\"Al Contado\",IF(AD21=2,\"En Cuotas\",\"\"))","v":"En Cuotas"}]
[null,null,null,null,null,null,null,null,null,"Monto Total a Pagar Mensual:",{"$f":"IF(ISERROR(IF(K22=\" \",\"---\",K25/K22)),0,IF(K22=\" \",\"---\",K25/K22))","v":0},"USD",null,null,null,null,null,null,null,null,null,null,null,null,null,null,null,null,null,"En Cuotas4C",0,{"$f":"+AF25&K22&AF24","v":"En CuotasC"}]
[null,null,null,null,null,null,null,null,null,null,null,null,null,null,null,null,null,null,null,null,null,null,null,null,null,null,null,null,null,"En Cuotas6DA",0.12,1]
[null,null,null,null,null,null,null,null,null,null,null,null,null,null,null,null,null,null,null,null,null,null,null,null,null,null,null,null,null,"En Cuotas6C",0.17499999999999999,1]
[null,null,null,null,null,null,null,null,null,null,null,null,null,null,null,null,null,null,null,null,null,null,null,null,null,null,null,null,null,"En Cuotas10DA",0.12,{"$f":"+IF(AE42=\"NO\",2,1)","v":2},"Débito"]
[null,null,null,null,null,null,null,null,null,null,null,null,null,null,null,null,null,null,null,null,null,null,null,null,null,null,null,null,null,"En Cuotas10C",0.17499999999999999,{"$f":"+IF(AE43=\"NO\",2,1)","v":2},"cupones"]
[null,null,null,null,null,null,null,null,null,null,null,null,null,null,null,null,null,null,null,null,null,null,null,null,null,null,null,null,null,"En Cuotas12DA",0.12]
[null,null,null,null,null,null,null,null,null,null,null,null,null,null,null,null,null,null,null,null,null,null,null,null,null,null,null,null,null,"En Cuotas12C",0.17499999999999999]
[null,null,null,null,null,null,null,null,null,null,null,null,null,null,null,null,null,null,null,null,null,null,null,null,null,null,null,null,null,null,"Dcto Contratante",{"$f":"Cotizador!$E$81","v":0}]
[null,null,null,null,null,null,null,null,null,null,null,null,null,null,null,null,null,null,null,null,null,null,null,null,null,null,null,null,null,null,null,"P.Natural","P.Juridica"]
[null,null,null,null,null,null,null,null,null,null,null,null,null,null,null,null,null,null,null,null,null,null,null,null,null,null,null,null,null,4,null,0.25,0.25]
[null,null,null,null,null,null,null,null,null,null,null,null,null,null,null,null,null,null,null,null,null,null,null,null,null,null,null,null,null,6,"Cupones",0.17464738217893,0.17224535521308482]
[null,null,null,null,null,null,null,null,null,null,null,null,null,null,null,null,null,null,null,null,null,null,null,null,null,null,null,null,null,10,"Cupones",0.10759130788909588,0.10529275549614135]
[]
[]
[]
[]
[null,null,null,null,null,null,null,null,null,null,null,null,null,null,null,null,null,null,null,null,null,null,null,null,null,null,null,null,null,"Débito Automático:",{"$f":"+IF($I$17=\"Débito Automático\",\"SÍ\",\"NO\")","v":"NO"}]
[null,null,null,null,null,null,null,null,null,null,null,null,null,null,null,null,null,null,null,null,null,null,null,null,null,null,null,null,null,"Cupones:",{"$f":"+IF($I$17=\"Cupones\",\"SÍ\",\"NO\")","v":"NO"}]
[]
[null,null,null,null,null,null,null,null,null,null,null,null,null,null,null,null,null,null,null,null,null,null,null,null,null,null,null,null,null,"Result",{"$f":"+IF(OR(K22=4,K22=12),VLOOKUP(K22,$AD$35:$AF$40,3,0),SUMPRODUCT(($AD$35:$AD$40=K22)*($AE$35:$AE$40=I17)*$AF$35:$AF$40))","v":0}]
[]
[null,null,null,null,null,null,null,null,null,null,null,null,null,null,null,null,null,null,null,null,null,null,null,null,null,null,null,null,null,1,"Débito Automático",2]
[null,null,null,null,null,null,null,null,null,null,null,null,null,null,null,null,null,null,null,null,null,null,null,null,null,null,null,null,null,2,"Cupones"]

{"sheet":"CoberturasaElegirLocal1","index":11,"n_rows":40,"n_cols":30,"rows_kept":40,"cut":false,"hidden":false,"merged":[[37,8,37,11],[15,7,15,11],[17,7,17,11],[26,8,27,11],[35,8,36,11],[26,13,27,13],[35,12,36,12],[35,13,36,13],[1,8,2,12],[10,7,10,11],[11,7,11,11],[18,6,18,15],[12,7,12,11],[13,7,13,11],[14,7,14,11],[26,12,27,12]]}
[]
[]
[]
[]
[null,null,null,null,null,null,null,null,null,null,null,null,null,null,null,{"$f":"+YEAR(TODAY())-50","v":1973},null,null,null,null,null,null,null,null,null,null,null,"SÍ",{"$f":"IF(ISERROR($M$31/$AB$7),0,$M$31/$AB$7)","v":0}]
[null,null,null,null,null,null,"Declaración de Bienes",null,null,null,null,null,null,null,null,null,null,null,null,null,null,null,null,null,null,null,null,"NO",{"$f":"IF(ISERROR($M$32/$AB$7),0,$M$32/$AB$7)","v":0}]
[null,null,null,null,null,null,null,null,null,null,null,null,null,null,null,null,null,null,null,null,null,null,null,null,null,null,null,{"$f":"+SUM(M31:M35)","v":0},{"$f":"IF(ISERROR($M$33/$AB$7),0,$M$33/$AB$7)","v":0}]
[null,null,null,null,null,null,null,"Tipo de Moneda:",{"$f":"IF(Cotizador!$D$7=0,\"\",Cotizador!$D$7)","v":"USD"},null,null,null,"Endosado al Banco?:",{"$f":"IF(Cotizador!$I$7=0,\"\",Cotizador!$I$7)","v":"NO"},null,null,null,null,null,null,null,null,null,null,null,1,null,null,{"$f":"IF(ISERROR($M$34/$AB$7),0,$M$34/$AB$7)","v":0}]
[null,null,null,null,null,null,null,null,null,null,null,null,null,null,null,null,null,null,null,null,null,null,null,null,null,2,null,null,{"$f":"IF(ISERROR($M$35/$AB$7),0,$M$35/$AB$7)","v":0}]
[null,null,null,null,null,null,null,null,null,null,null,null,"Totales","Endosado",null,null,null,null,null,null,null,null,null,null,null,3]
[null,null,null,null,null,null,null,"Edificio (sin considerar el valor del terreno)",null,null,null,null,{"$f":"IF(Cotizador!$H$10=0,\"\",Cotizador!$H$10)","v":""},{"$f":"IF(Cotizador!$I$10=0,\"\",Cotizador!$I$10)","v":""},{"$f":"IF(N11=\"\",\"\",IF(OR(AND($N$8=\"NO\",N11>0),AND($N$8=\"SÍ\",M11=\"\")),\"Endosado Invalido\",\"\"))","v":""},null,null,null,null,null,null,null,null,null,null,4]
[null,null,null,null,null,null,null,"Instalaciones fijas",null,null,null,null,{"$f":"IF(Cotizador!$H$11=0,\"\",Cotizador!$H$11)","v":""},{"$f":"IF(Cotizador!$I$11=0,\"\",Cotizador!$I$11)","v":""},"",null,null,null,null,null,null,null,null,null,null,5,null,"RM",1,2]
[null,null,null,null,null,null,null,"Mobiliario y/o contenido propios del giro",null,null,null,null,{"$f":"IF(Cotizador!$H$12=0,\"\",Cotizador!$H$12)","v":""},{"$f":"IF(Cotizador!$I$12=0,\"\",Cotizador!$I$12)","v":""},"",null,null,null,null,null,null,null,null,null,null,null,null,"EQEL",1]
[null,null,null,null,null,null,null,"Existencias propias del giro del negocio",null,null,null,null,{"$f":"IF(Cotizador!$H$13=0,\"\",Cotizador!$H$13)","v":""},{"$f":"IF(Cotizador!$I$13=0,\"\",Cotizador!$I$13)","v":""},"",null,null,null,null,null,null,null,null,null,null,null,null,"EQMOV",1]
[null,null,null,null,null,null,null,"Maquinaria propia del giro del negocio",null,null,null,null,{"$f":"IF(Cotizador!$H$14=0,\"\",Cotizador!$H$14)","v":""},{"$f":"IF(Cotizador!$I$14=0,\"\",Cotizador!$I$14)","v":""},"",null,null,null,null,null,null,null,null,null,null,null,null,"ROBO",1]
[null,null,null,null,null,null,null,"Equipos electrónicos propios del giro del negocio",null,null,null,null,{"$f":"IF(Cotizador!$H$15=0,\"\",Cotizador!$H$15)","v":""},{"$f":"IF(Cotizador!$I$15=0,\"\",Cotizador!$I$15)","v":""},"",null,null,null,null,null,null,null,null,null,null,null,null,"DINERO",1]
[null,null,null,null,null,null,null,"Lucro Cesante",null,null,null,null,{"$f":"IF(Cotizador!$H$16=0,\"\",Cotizador!$H$16)","v":""},{"$f":"IF(Cotizador!$I$16=0,\"\",Cotizador!$I$16)","v":""},null,null,null,null,null,null,null,null,null,null,null,null,null,"RC",1]
[null,null,null,null,null,null,null,"TOTAL VALOR DECLARADO (Máximo 2'000,000 USD)",null,null,null,null,{"$f":"+IF(OR(SUM($M$11:$M$17)<=0,SUM($M$11:$M$17)>2000000),\"\",SUM($M$11:$M$17))","v":""},{"$f":"+IF($M$18=\"\",\"\",IF($N$8=\"NO\",\"\",(IF(SUM($N$11:$N$17)>SUM($M$11:$M$17),\"\",SUM($N$11:$N$17)))))","v":""},null,null,null,null,null,null,null,null,null,null,null,null,null,"DINEROTRANS",1]
[null,null,null,null,null,null,{"$f":"+IF(SUM(M11:M16)>2000000,\"Sus Valores suman \"&SUM(M11:M16)&\" USD, por favor corrija los montos\",\"\")","v":""}]
[null,null,null,null,null,null,"Coberturas"]
[]
[null,null,null,null,null,null,null,null,null,null,null,null,"Valor Declarado","Valor Asegurado"]
[null,null,null,null,null,null,null,{"$f":"IF(Cotizador!$F$40=0,\"\",Cotizador!$F$40)","v":"NO"},"Rotura de Maquinaria",null,null,null,{"$f":"+IF($M$18=\"\",\"\",IF($H$23=\"NO\",\"\",IF($M$15>0,$M$15,\"\")))","v":""},{"$f":"+IF($M$23=\"\",\"\",IF($M$23>200000,200000,$M$23))","v":""}]
[]
[null,null,null,null,null,null,null,null,"Equipo Electrónico"]
[null,null,null,null,null,null,null,{"$f":"IF(Cotizador!$F$36=0,\"\",Cotizador!$F$36)","v":"NO"},"Equipos electrónicos propios del giro del negocio",null,null,null,{"$f":"+IF($M$18=\"\",\"\",IF($H$26=\"NO\",\"\",IF($M$16>0,$M$16,\"\")))","v":""},{"$f":"+IF($M$26=\"\",\"\",IF($M$26>50000,50000,$M$26))","v":""}]
[null,null,null,null,null,null,null,{"$f":"IF(Cotizador!$F$37=0,\"\",Cotizador!$F$37)","v":"NO"},"Equipos móviles y portátiles fuera del predio limitado a laptops y/o notebooks",null,null,null,{"$f":"+IF($H$27=\"NO\",\"\",IF($N$26=\"\",\"\",IF(3000>$N$26,$N$26,3000)))","v":""},{"$f":"+IF($M$27=\"\",\"\",$M$27)","v":""}]
[]
[]
[null,null,null,null,null,null,null,{"$f":"IF(Cotizador!$F$23=0,\"\",Cotizador!$F$23)","v":"SI"},"Robo y/o Asalto"]
[null,null,null,null,null,null,null,null,"Instalaciones fijas",null,null,null,{"$f":"+IF($M$18=\"\",\"\",IF($H$30=\"NO\",\"\",IF($M$12>0,$M$12,\"\")))","v":""},{"$f":"+IF($M$31=\"\",\"\",IF($M$31>100000*AC5,100000*$AC$5,$M$31))","v":""}]
[null,null,null,null,null,null,null,null,"Mobiliario y/o contenido propios del giro del negocio",null,null,null,{"$f":"+IF($M$18=\"\",\"\",IF($H$30=\"NO\",\"\",IF($M$13>0,$M$13,\"\")))","v":""},{"$f":"+IF($M$32=\"\",\"\",IF($M$32>100000*AC6,100000*$AC$6,$M$32))","v":""}]
[null,null,null,null,null,null,null,null,"Existencias propias del giro del negocio",null,null,null,{"$f":"+IF($M$18=\"\",\"\",IF($H$30=\"NO\",\"\",IF($M$14>0,$M$14,\"\")))","v":""},{"$f":"+IF($M$33=\"\",\"\",IF($M$33>100000*$AC$7,100000*$AC$7,$M$33))","v":""}]
[null,null,null,null,null,null,null,null,"Maquinaria propia del giro del negocio",null,null,null,{"$f":"+IF($M$18=\"\",\"\",IF($H$30=\"NO\",\"\",IF($M$15>0,$M$15,\"\")))","v":""},{"$f":"+IF($M$34=\"\",\"\",IF($M$34>100000*$AC$8,100000*$AC$8,$M$34))","v":""}]
[null,null,null,null,null,null,null,null,"Equipo electrónico fijo",null,null,null,{"$f":"+IF($M$18=\"\",\"\",IF($H$30=\"NO\",\"\",IF($M$16>0,$M$16,\"\")))","v":""},{"$f":"+IF($M$35=\"\",\"\",IF($M$35>100000*$AC$9,100000*$AC$9,$M$35))","v":""}]
[null,null,null,null,null,null,null,{"$f":"IF(Cotizador!$F$29=0,\"\",Cotizador!$F$29)","v":"SI"},"Dinero y/o valores dentro del local (caja chica y/o caja\nregistradora)",null,null,null,{"$f":"IF(Cotizador!$H$29=0,\"\",Cotizador!$H$29)","v":"---------"},{"$f":"+IF($AB$7=0,\"\",IF($H$36=\"NO\",\"\",IF($AB$7<3000,$AB$7,3000)))","v":""}]
[]
[null,null,null,null,null,null,null,{"$f":"IF(Cotizador!$F$31=0,\"\",Cotizador!$F$31)","v":"SI"},"Dinero en Tránsito",null,null,null,{"$f":"IF(Cotizador!$H$31=0,\"\",Cotizador!$H$31)","v":"---------"},{"$f":"+IF($AB$7=0,\"\",IF($H$38=\"NO\",\"\",IF($AB$7<3000,$AB$7,3000)))","v":""}]
[]
[null,null,null,null,null,null,null,{"$f":"IF(Cotizador!$F$33=0,\"\",Cotizador!$F$33)","v":"SI"},"Responsabilidad Civil",null,"Opción:",{"$f":"IF(Cotizador!$H$33=0,\"\",Cotizador!$H$33)","v":1},null,{"$f":"IF(H17=\"\",\"\",IF(H40=\"NO\",\"\",IF(L40=1,50000,IF(L40=2,100000,IF(L40=3,200000,IF(L40=4,300000,500000))))))","v":50000}]

{"sheet":"CoberturasaElegirLocal2","index":12,"n_rows":40,"n_cols":30,"rows_kept":40,"cut":false,"hidden":false,"merged":[[35,8,36,11],[35,12,36,12],[35,13,36,13],[37,8,37,11],[15,7,15,11],[17,7,17,11],[18,6,18,15],[26,8,27,11],[26,12,27,12],[26,13,27,13],[14,7,14,11],[1,8,2,12],[10,7,10,11],[11,7,11,11],[12,7,12,11],[13,7,13,11]]}
[]
[]
[]
[]
[null,null,null,null,null,null,null,null,null,null,null,null,null,null,null,null,null,null,null,null,null,null,null,null,null,null,null,"SÍ",{"$f":"IF(ISERROR($M$31/$AB$7),0,$M$31/$AB$7)","v":0}]
[null,null,null,null,null,null,"Declaración de Bienes",null,null,null,null,null,null,null,null,null,null,null,null,null,null,null,null,null,null,null,null,"NO",{"$f":"IF(ISERROR($M$32/$AB$7),0,$M$32/$AB$7)","v":0}]
[null,null,null,null,null,null,null,null,null,null,null,null,null,null,null,null,null,null,null,null,null,null,null,null,null,null,null,{"$f":"+SUM(M31:M35)","v":0},{"$f":"IF(ISERROR($M$33/$AB$7),0,$M$33/$AB$7)","v":0}]
[null,null,null,null,null,null,null,"Tipo de Moneda:",{"$f":"IF(Cotizador!$D$7=0,\"\",Cotizador!$D$7)","v":"USD"},null,null,null,"Endosado al Banco?:",{"$f":"IF(Cotizador!$N$7=0,\"\",Cotizador!$N$7)","v":"NO"},null,null,null,null,null,null,null,null,null,null,null,1,null,null,{"$f":"IF(ISERROR($M$34/$AB$7),0,$M$34/$AB$7)","v":0}]
[null,null,null,null,null,null,null,null,null,null,null,null,null,null,null,null,null,null,null,null,null,null,null,null,null,2,null,null,{"$f":"IF(ISERROR($M$35/$AB$7),0,$M$35/$AB$7)","v":0}]
[null,null,null,null,null,null,null,null,null,null,null,null,"Totales","Endosado",null,null,null,null,null,null,null,null,null,null,null,3]
[null,null,null,null,null,null,null,"Edificio (sin considerar el valor del terreno ni Instalaciones Fijas)",null,null,null,null,{"$f":"IF(Cotizador!$M$10=0,\"\",Cotizador!$M$10)","v":""},{"$f":"IF(Cotizador!$N$10=0,\"\",Cotizador!$N$10)","v":""},{"$f":"IF(N11=\"\",\"\",IF(OR(AND($N$8=\"NO\",N11>0),AND($N$8=\"SÍ\",M11=\"\")),\"Endosado Invalido\",\"\"))","v":""},null,null,null,null,null,null,null,null,null,null,4]
[null,null,null,null,null,null,null,"Instalaciones fijas",null,null,null,null,{"$f":"IF(Cotizador!$M$11=0,\"\",Cotizador!$M$11)","v":""},{"$f":"IF(Cotizador!$N$11=0,\"\",Cotizador!$N$11)","v":""},"",null,null,null,null,null,null,null,null,null,null,5,null,"RM",1,2]
[null,null,null,null,null,null,null,"Mobiliario y/o contenido propios del giro",null,null,null,null,{"$f":"IF(Cotizador!$M$12=0,\"\",Cotizador!$M$12)","v":""},{"$f":"IF(Cotizador!$N$12=0,\"\",Cotizador!$N$12)","v":""},"",null,null,null,null,null,null,null,null,null,null,null,null,"EQEL",1]
[null,null,null,null,null,null,null,"Existencias propias del giro del negocio",null,null,null,null,{"$f":"IF(Cotizador!$M$13=0,\"\",Cotizador!$M$13)","v":""},{"$f":"IF(Cotizador!$N$13=0,\"\",Cotizador!$N$13)","v":""},"",null,null,null,null,null,null,null,null,null,null,null,null,"EQMOV",1]
[null,null,null,null,null,null,null,"Maquinaria propia del giro del negocio",null,null,null,null,{"$f":"IF(Cotizador!$M$14=0,\"\",Cotizador!$M$14)","v":""},{"$f":"IF(Cotizador!$N$14=0,\"\",Cotizador!$N$14)","v":""},"",null,null,null,null,null,null,null,null,null,null,null,null,"ROBO",1]
[null,null,null,null,null,null,null,"Equipos electrónicos propios del giro del negocio",null,null,null,null,{"$f":"IF(Cotizador!$M$15=0,\"\",Cotizador!$M$15)","v":""},{"$f":"IF(Cotizador!$N$15=0,\"\",Cotizador!$N$15)","v":""},"",null,null,null,null,null,null,null,null,null,null,null,null,"DINERO",1]
[null,null,null,null,null,null,null,"Lucro Cesante",null,null,null,null,{"$f":"IF(Cotizador!$M$16=0,\"\",Cotizador!$M$16)","v":""},{"$f":"IF(Cotizador!$N$16=0,\"\",Cotizador!$N$16)","v":""},null,null,null,null,null,null,null,null,null,null,null,null,null,"RC",1]
[null,null,null,null,null,null,null,"TOTAL VALOR DECLARADO (Máximo 2'000,000 USD)",null,null,null,null,{"$f":"+IF(OR(SUM($M$11:$M$17)<=0,SUM($M$11:$M$17)>2000000),\"\",SUM($M$11:$M$17))","v":""},{"$f":"+IF($M$18=\"\",\"\",IF($N$8=\"NO\",\"\",(IF(SUM($N$11:$N$17)>SUM($M$11:$M$17),\"\",SUM($N$11:$N$17)))))","v":""},null,null,null,null,null,null,null,null,null,null,null,null,null,"DINEROTRANS",1]
[null,null,null,null,null,null,{"$f":"+IF(SUM(M11:M16)>2000000,\"Sus Valores suman \"&SUM(M11:M16)&\" USD, por favor corrija los montos\",\"\")","v":""}]
[null,null,null,null,null,null,"Coberturas"]
[]
[null,null,null,null,null,null,null,null,null,null,null,null,"Valor Declarado","Valor Asegurado"]
[null,null,null,null,null,null,null,{"$f":"IF(Cotizador!$K$40=0,\"\",Cotizador!$K$40)","v":"NO"},"Rotura de Maquinaria",null,null,null,{"$f":"+IF($M$18=\"\",\"\",IF($H$23=\"NO\",\"\",IF($M$15>0,$M$15,\"\")))","v":""},{"$f":"+IF($M$23=\"\",\"\",IF($M$23>200000,200000,$M$23))","v":""}]
[]
[null,null,null,null,null,null,null,null,"Equipo Electrónico"]
[null,null,null,null,null,null,null,{"$f":"IF(Cotizador!$K$36=0,\"\",Cotizador!$K$36)","v":"NO"},"Equipos electrónicos propios del giro del negocio",null,null,null,{"$f":"+IF($M$18=\"\",\"\",IF($H$26=\"NO\",\"\",IF($M$16>0,$M$16,\"\")))","v":""},{"$f":"+IF($M$26=\"\",\"\",IF($M$26>50000,50000,$M$26))","v":""}]
[null,null,null,null,null,null,null,{"$f":"IF(Cotizador!$K$37=0,\"\",Cotizador!$K$37)","v":"NO"},"Equipos móviles y portátiles fuera del predio limitado a laptops y/o notebooks",null,null,null,{"$f":"+IF($H$27=\"NO\",\"\",IF($N$26=\"\",\"\",IF(3000>$N$26,$N$26,3000)))","v":""},{"$f":"+IF($M$27=\"\",\"\",$M$27)","v":""}]
[]
[]
[null,null,null,null,null,null,null,{"$f":"IF(Cotizador!$K$23=0,\"\",Cotizador!$K$23)","v":"NO"},"Robo y/o Asalto"]
[null,null,null,null,null,null,null,null,"Instalaciones fijas",null,null,null,{"$f":"+IF($M$18=\"\",\"\",IF($H$30=\"NO\",\"\",IF($M$12>0,$M$12,\"\")))","v":""},{"$f":"+IF($M$31=\"\",\"\",IF($M$31>100000*AC5,100000*$AC$5,$M$31))","v":""}]
[null,null,null,null,null,null,null,null,"Mobiliario y/o contenido propios del giro del negocio",null,null,null,{"$f":"+IF($M$18=\"\",\"\",IF($H$30=\"NO\",\"\",IF($M$13>0,$M$13,\"\")))","v":""},{"$f":"+IF($M$32=\"\",\"\",IF($M$32>100000*AC6,100000*$AC$6,$M$32))","v":""}]
[null,null,null,null,null,null,null,null,"Existencias propias del giro del negocio",null,null,null,{"$f":"+IF($M$18=\"\",\"\",IF($H$30=\"NO\",\"\",IF($M$14>0,$M$14,\"\")))","v":""},{"$f":"+IF($M$33=\"\",\"\",IF($M$33>100000*$AC$7,100000*$AC$7,$M$33))","v":""}]
[null,null,null,null,null,null,null,null,"Maquinaria propia del giro del negocio",null,null,null,{"$f":"+IF($M$18=\"\",\"\",IF($H$30=\"NO\",\"\",IF($M$15>0,$M$15,\"\")))","v":""},{"$f":"+IF($M$34=\"\",\"\",IF($M$34>100000*$AC$8,100000*$AC$8,$M$34))","v":""}]
[null,null,null,null,null,null,null,null,"Equipo electrónico fijo",null,null,null,{"$f":"+IF($M$18=\"\",\"\",IF($H$30=\"NO\",\"\",IF($M$16>0,$M$16,\"\")))","v":""},{"$f":"+IF($M$35=\"\",\"\",IF($M$35>100000*$AC$9,100000*$AC$9,$M$35))","v":""}]
[null,null,null,null,null,null,null,{"$f":"IF(Cotizador!$K$29=0,\"\",Cotizador!$K$29)","v":"NO"},"Dinero y/o valores dentro del local (caja chica y/o caja\nregistradora)",null,null,null,{"$f":"IF(Cotizador!$M$29=0,\"\",Cotizador!$M$29)","v":"---------"},{"$f":"+IF($AB$7=0,\"\",IF($H$36=\"NO\",\"\",IF($AB$7<3000,$AB$7,3000)))","v":""}]
[]
[null,null,null,null,null,null,null,{"$f":"IF(Cotizador!$K$31=0,\"\",Cotizador!$K$31)","v":"NO"},"Dinero en Tránsito",null,null,null,{"$f":"IF(Cotizador!$M$31=0,\"\",Cotizador!$M$31)","v":"---------"},{"$f":"+IF($AB$7=0,\"\",IF($H$38=\"NO\",\"\",IF($AB$7<3000,$AB$7,3000)))","v":""}]
[]
[null,null,null,null,null,null,null,{"$f":"IF(Cotizador!$K$33=0,\"\",Cotizador!$K$33)","v":"NO"},"Responsabilidad Civil",null,"Opción:",{"$f":"IF(Cotizador!$M$33=0,\"\",Cotizador!$M$33)","v":1},null,{"$f":"IF(H17=\"\",\"\",IF(H40=\"NO\",\"\",IF(L40=1,50000,IF(L40=2,100000,IF(L40=3,200000,IF(L40=4,300000,500000))))))","v":""}]

{"sheet":"CoberturasaElegirLocal3","index":13,"n_rows":40,"n_cols":30,"rows_kept":40,"cut":false,"hidden":false,"merged":[[35,8,36,11],[35,12,36,12],[35,13,36,13],[37,8,37,11],[15,7,15,11],[17,7,17,11],[18,6,18,15],[26,8,27,11],[26,12,27,12],[26,13,27,13],[14,7,14,11],[1,8,2,12],[10,7,10,11],[11,7,11,11],[12,7,12,11],[13,7,13,11]]}
[]
[]
[]
[]
[null,null,null,null,null,null,null,null,null,null,null,null,null,null,null,null,null,null,null,null,null,null,null,null,null,null,null,"SÍ",{"$f":"IF(ISERROR($M$31/$AB$7),0,$M$31/$AB$7)","v":0}]
[null,null,null,null,null,null,"Declaración de Bienes",null,null,null,null,null,null,null,null,null,null,null,null,null,null,null,null,null,null,null,null,"NO",{"$f":"IF(ISERROR($M$32/$AB$7),0,$M$32/$AB$7)","v":0}]
[null,null,null,null,null,null,null,null,null,null,null,null,null,null,null,null,null,null,null,null,null,null,null,null,null,null,null,{"$f":"+SUM(M31:M35)","v":0},{"$f":"IF(ISERROR($M$33/$AB$7),0,$M$33/$AB$7)","v":0}]
[null,null,null,null,null,null,null,"Tipo de Moneda:",{"$f":"IF(Cotizador!$D$7=0,\"\",Cotizador!$D$7)","v":"USD"},null,null,null,"Endosado al Banco?:",{"$f":"IF(Cotizador!$S$7=0,\"\",Cotizador!$S$7)","v":"NO"},null,null,null,null,null,null,null,null,null,null,null,1,null,null,{"$f":"IF(ISERROR($M$34/$AB$7),0,$M$34/$AB$7)","v":0}]
[null,null,null,null,null,null,null,null,null,null,null,null,null,null,null,null,null,null,null,null,null,null,null,null,null,2,null,null,{"$f":"IF(ISERROR($M$35/$AB$7),0,$M$35/$AB$7)","v":0}]
[null,null,null,null,null,null,null,null,null,null,null,null,"Totales","Endosado",null,null,null,null,null,null,null,null,null,null,null,3]
[null,null,null,null,null,null,null,"Edificio (sin considerar el valor del terreno ni Instalaciones Fijas)",null,null,null,null,{"$f":"IF(Cotizador!$R$10=0,\"\",Cotizador!$R$10)","v":""},{"$f":"IF(Cotizador!$S$10=0,\"\",Cotizador!$S$10)","v":""},{"$f":"IF(N11=\"\",\"\",IF(OR(AND($N$8=\"NO\",N11>0),AND($N$8=\"SÍ\",M11=\"\")),\"Endosado Invalido\",\"\"))","v":""},null,null,null,null,null,null,null,null,null,null,4]
[null,null,null,null,null,null,null,"Instalaciones fijas",null,null,null,null,{"$f":"IF(Cotizador!$R$11=0,\"\",Cotizador!$R$11)","v":""},{"$f":"IF(Cotizador!$S$11=0,\"\",Cotizador!$S$11)","v":""},"",null,null,null,null,null,null,null,null,null,null,5,null,"RM",1,2]
[null,null,null,null,null,null,null,"Mobiliario y/o contenido propios del giro",null,null,null,null,{"$f":"IF(Cotizador!$R$12=0,\"\",Cotizador!$R$12)","v":""},{"$f":"IF(Cotizador!$S$12=0,\"\",Cotizador!$S$12)","v":""},"",null,null,null,null,null,null,null,null,null,null,null,null,"EQEL",1]
[null,null,null,null,null,null,null,"Existencias propias del giro del negocio",null,null,null,null,{"$f":"IF(Cotizador!$R$13=0,\"\",Cotizador!$R$13)","v":""},{"$f":"IF(Cotizador!$S$13=0,\"\",Cotizador!$S$13)","v":""},"",null,null,null,null,null,null,null,null,null,null,null,null,"EQMOV",1]
[null,null,null,null,null,null,null,"Maquinaria propia del giro del negocio",null,null,null,null,{"$f":"IF(Cotizador!$R$14=0,\"\",Cotizador!$R$14)","v":""},{"$f":"IF(Cotizador!$S$14=0,\"\",Cotizador!$S$14)","v":""},"",null,null,null,null,null,null,null,null,null,null,null,null,"ROBO",1]
[null,null,null,null,null,null,null,"Equipos electrónicos propios del giro del negocio",null,null,null,null,{"$f":"IF(Cotizador!$R$15=0,\"\",Cotizador!$R$15)","v":""},{"$f":"IF(Cotizador!$S$15=0,\"\",Cotizador!$S$15)","v":""},"",null,null,null,null,null,null,null,null,null,null,null,null,"DINERO",1]
[null,null,null,null,null,null,null,"Lucro Cesante",null,null,null,null,{"$f":"IF(Cotizador!$R$16=0,\"\",Cotizador!$R$16)","v":""},{"$f":"IF(Cotizador!$S$16=0,\"\",Cotizador!$S$16)","v":""},null,null,null,null,null,null,null,null,null,null,null,null,null,"RC",1]
[null,null,null,null,null,null,null,"TOTAL VALOR DECLARADO (Máximo 2'000,000 USD)",null,null,null,null,{"$f":"+IF(OR(SUM($M$11:$M$17)<=0,SUM($M$11:$M$17)>2000000),\"\",SUM($M$11:$M$17))","v":""},{"$f":"+IF($M$18=\"\",\"\",IF($N$8=\"NO\",\"\",(IF(SUM($N$11:$N$17)>SUM($M$11:$M$17),\"\",SUM($N$11:$N$17)))))","v":""},null,null,null,null,null,null,null,null,null,null,null,null,null,"DINEROTRANS",1]
[null,null,null,null,null,null,{"$f":"+IF(SUM(M11:M16)>2000000,\"Sus Valores suman \"&SUM(M11:M16)&\" USD, por favor corrija los montos\",\"\")","v":""}]
[null,null,null,null,null,null,"Coberturas"]
[]
[null,null,null,null,null,null,null,null,null,null,null,null,"Valor Declarado","Valor Asegurado"]
[null,null,null,null,null,null,null,{"$f":"IF(Cotizador!$P$40=0,\"\",Cotizador!$P$40)","v":"NO"},"Rotura de Maquinaria",null,null,null,{"$f":"+IF($M$18=\"\",\"\",IF($H$23=\"NO\",\"\",IF($M$15>0,$M$15,\"\")))","v":""},{"$f":"+IF($M$23=\"\",\"\",IF($M$23>200000,200000,$M$23))","v":""}]
[]
[null,null,null,null,null,null,null,null,"Equipo Electrónico"]
[null,null,null,null,null,null,null,{"$f":"IF(Cotizador!$P$36=0,\"\",Cotizador!$P$36)","v":"NO"},"Equipos electrónicos propios del giro del negocio",null,null,null,{"$f":"+IF($M$18=\"\",\"\",IF($H$26=\"NO\",\"\",IF($M$16>0,$M$16,\"\")))","v":""},{"$f":"+IF($M$26=\"\",\"\",IF($M$26>50000,50000,$M$26))","v":""}]
[null,null,null,null,null,null,null,{"$f":"IF(Cotizador!$P$37=0,\"\",Cotizador!$P$37)","v":"NO"},"Equipos móviles y portátiles fuera del predio limitado a laptops y/o notebooks",null,null,null,{"$f":"+IF($H$27=\"NO\",\"\",IF($N$26=\"\",\"\",IF(3000>$N$26,$N$26,3000)))","v":""},{"$f":"+IF($M$27=\"\",\"\",$M$27)","v":""}]
[]
[]
[null,null,null,null,null,null,null,{"$f":"IF(Cotizador!$P$23=0,\"\",Cotizador!$P$23)","v":"NO"},"Robo y/o Asalto"]
[null,null,null,null,null,null,null,null,"Instalaciones fijas",null,null,null,{"$f":"+IF($M$18=\"\",\"\",IF($H$30=\"NO\",\"\",IF($M$12>0,$M$12,\"\")))","v":""},{"$f":"+IF($M$31=\"\",\"\",IF($M$31>100000*AC5,100000*$AC$5,$M$31))","v":""}]
[null,null,null,null,null,null,null,null,"Mobiliario y/o contenido propios del giro del negocio",null,null,null,{"$f":"+IF($M$18=\"\",\"\",IF($H$30=\"NO\",\"\",IF($M$13>0,$M$13,\"\")))","v":""},{"$f":"+IF($M$32=\"\",\"\",IF($M$32>100000*AC6,100000*$AC$6,$M$32))","v":""}]
[null,null,null,null,null,null,null,null,"Existencias propias del giro del negocio",null,null,null,{"$f":"+IF($M$18=\"\",\"\",IF($H$30=\"NO\",\"\",IF($M$14>0,$M$14,\"\")))","v":""},{"$f":"+IF($M$33=\"\",\"\",IF($M$33>100000*$AC$7,100000*$AC$7,$M$33))","v":""}]
[null,null,null,null,null,null,null,null,"Maquinaria propia del giro del negocio",null,null,null,{"$f":"+IF($M$18=\"\",\"\",IF($H$30=\"NO\",\"\",IF($M$15>0,$M$15,\"\")))","v":""},{"$f":"+IF($M$34=\"\",\"\",IF($M$34>100000*$AC$8,100000*$AC$8,$M$34))","v":""}]
[null,null,null,null,null,null,null,null,"Equipo electrónico fijo",null,null,null,{"$f":"+IF($M$18=\"\",\"\",IF($H$30=\"NO\",\"\",IF($M$16>0,$M$16,\"\")))","v":""},{"$f":"+IF($M$35=\"\",\"\",IF($M$35>100000*$AC$9,100000*$AC$9,$M$35))","v":""}]
[null,null,null,null,null,null,null,{"$f":"IF(Cotizador!$P$29=0,\"\",Cotizador!$P$29)","v":"NO"},"Dinero y/o valores dentro del local (caja chica y/o caja\nregistradora)",null,null,null,{"$f":"IF(Cotizador!$R$29=0,\"\",Cotizador!$R$29)","v":"---------"},{"$f":"+IF($AB$7=0,\"\",IF($H$36=\"NO\",\"\",IF($AB$7<3000,$AB$7,3000)))","v":""}]
[]
[null,null,null,null,null,null,null,{"$f":"IF(Cotizador!$P$31=0,\"\",Cotizador!$P$31)","v":"NO"},"Dinero en Tránsito",null,null,null,{"$f":"IF(Cotizador!$R$31=0,\"\",Cotizador!$R$31)","v":"---------"},{"$f":"+IF($AB$7=0,\"\",IF($H$38=\"NO\",\"\",IF($AB$7<3000,$AB$7,3000)))","v":""}]
[]
[null,null,null,null,null,null,null,{"$f":"IF(Cotizador!$P$33=0,\"\",Cotizador!$P$33)","v":"NO"},"Responsabilidad Civil",null,"Opción:",{"$f":"IF(Cotizador!$R$33=0,\"\",Cotizador!$R$33)","v":1},null,{"$f":"IF(H17=\"\",\"\",IF(H40=\"NO\",\"\",IF(L40=1,50000,IF(L40=2,100000,IF(L40=3,200000,IF(L40=4,300000,500000))))))","v":""}]

{"sheet":"CartillaVentaPyme","index":14,"n_rows":0,"n_cols":0,"rows_kept":0,"cut":false,"hidden":false,"merged":[]}

{"sheet":"slipcotizador","index":15,"n_rows":0,"n_cols":0,"rows_kept":0,"cut":false,"hidden":false,"merged":[]}

{"sheet":"Slip CONSOLIDADO","index":16,"n_rows":445,"n_cols":15,"rows_kept":445,"cut":false,"hidden":false,"merged":[[411,0,412,12],[413,0,413,12],[403,0,403,12],[23,2,23,12],[171,8,171,9],[171,1,171,4],[265,0,265,12],[262,0,262,12],[287,0,287,4],[290,0,290,4],[291,0,291,4],[289,0,289,4],[288,0,288,4],[166,8,166,9],[113,0,113,8],[166,11,166,12],[164,5,164,6],[76,1,77,4],[76,5,77,6],[76,8,77,9],[329,0,329,12],[341,0,341,12],[27,0,27,12],[30,0,33,12],[438,0,439,6],[418,0,419,12],[414,0,415,12],[416,0,417,12],[292,0,292,4],[312,0,314,12],[319,0,321,12],[358,1,358,4],[344,0,344,12],[333,0,336,12],[347,0,350,12],[357,8,357,9],[364,1,364,4],[365,1,367,4],[368,1,370,4],[371,1,372,4],[358,11,358,12],[371,8,372,9],[371,5,372,6],[359,11,360,12],[358,5,358,6],[357,5,357,6],[409,0,410,12],[364,11,364,12],[55,5,55,6],[55,8,55,9],[55,11,55,12],[36,0,36,6],[56,5,58,6],[56,8,58,9],[56,11,58,12],[40,11,40,12],[39,5,39,6],[48,0,48,4],[40,5,40,6],[47,0,47,4],[42,0,42,4],[43,0,43,4],[44,0,44,4],[45,0,45,4],[46,0,46,4],[39,8,39,9],[39,11,39,12],[62,0,62,12],[365,11,367,12],[112,0,112,6],[131,0,131,6],[181,0,181,3],[118,3,118,6],[184,0,185,12],[137,0,138,12],[171,11,171,12],[172,11,172,12],[173,11,173,12],[166,5,166,6],[154,0,157,12],[165,11,165,12],[132,0,136,6],[170,5,170,6],[164,8,164,9],[164,11,164,12],[147,0,147,12],[150,0,150,12],[114,7,114,8],[170,8,170,9],[258,0,258,6],[260,0,260,6],[266,0,267,6],[49,0,49,4],[73,1,75,4],[73,5,75,6],[73,8,75,9],[73,11,75,12],[40,8,40,9],[79,1,79,4],[79,5,79,6],[79,8,79,9],[79,11,79,12],[78,5,78,6],[67,1,68,4],[67,5,68,6],[55,0,55,4],[54,5,54,6],[54,8,54,9],[54,11,54,12],[78,11,78,12],[78,1,78,4],[69,8,72,9],[69,11,72,12],[65,5,65,6],[78,8,78,9],[1,0,1,12],[6,0,7,6],[25,0,25,12],[21,2,21,12],[22,2,22,12],[10,0,10,1],[9,0,9,1],[11,0,11,12],[5,0,5,1],[5,2,5,12],[8,0,8,1],[8,2,8,12],[16,2,16,12],[17,2,17,12],[13,0,13,1],[13,2,13,12],[18,2,18,12],[226,11,228,12],[237,1,237,4],[232,1,232,4],[225,1,225,4],[172,1,172,4],[237,8,237,9],[236,1,236,4],[232,11,232,12],[215,0,217,12],[211,0,211,12],[203,0,204,12],[172,5,172,6],[173,5,173,6],[208,0,208,12],[173,1,173,4],[236,5,236,6],[237,5,237,6],[172,8,172,9],[173,8,173,9],[191,0,191,12],[193,0,193,6],[192,0,192,6],[283,0,283,4],[224,5,224,6],[224,8,224,9],[224,11,224,12],[237,11,237,12],[282,5,282,6],[225,8,225,9],[273,0,273,12],[233,5,235,6],[233,11,235,12],[236,11,236,12],[232,5,232,6],[231,5,231,6],[231,8,231,9],[231,11,231,12],[232,8,232,9],[233,8,235,9],[236,8,236,9],[226,1,228,4],[233,1,235,4],[225,5,225,6],[226,5,228,6],[226,8,228,9],[225,11,225,12],[285,0,285,4],[373,1,374,4],[373,5,374,6],[373,8,374,9],[373,11,374,12],[282,8,282,9],[282,11,282,12],[270,0,270,12],[277,0,279,12],[371,11,372,12],[359,8,360,9],[364,8,364,9],[368,8,370,9],[359,5,360,6],[358,8,358,9],[284,0,284,4],[364,5,364,6],[365,5,367,6],[359,1,360,4],[365,8,367,9],[368,11,370,12],[286,0,286,4],[368,5,370,6],[357,11,357,12],[171,5,171,6],[110,0,111,12],[67,8,68,9],[67,11,68,12],[65,11,65,12],[66,1,66,4],[66,5,66,6],[66,8,66,9],[66,11,66,12],[165,8,165,9],[170,11,170,12],[165,5,165,6],[165,1,165,4],[114,0,114,6],[124,0,124,12],[166,1,166,4],[76,11,77,12],[141,0,142,12],[69,1,72,4],[69,5,72,6],[65,8,65,9]]}
[]
["PROTECCIÓN PARA NEGOCIO",null,null,null,null,null,null,null,null,null,null,null,null,null,"OK"]
[]
[]
[]
["CONTRATANTE",null,{"$f":"Solicitud.Manual!$C$9 & \" \" &Solicitud.Manual!$C$10 & \" \" & Solicitud.Manual!$E$10","v":"  "}]
[]
[]
["CORREDOR",null,{"$f":"Solicitud.Manual!$D$148","v":0}]
["VIGENCIA",null,{"$f":"PagodePrimasLocal1!$N$22","v":""},"al",{"$f":"+IF(C10=\"\",\"\",IF(DAY(C10)<10,0&DAY(C10),DAY(C10))&\"/\"&IF(MONTH(C10)<10,0&MONTH(C10),MONTH(C10))&\"/\"&YEAR(C10)+1)","v":""},"12:00 Hrs"]
["MONEDA",null,"DÓLARES"]
["CONDICIONES PARTICULARES"]
[]
["ASEGURADO",null,{"$f":"Solicitud.Manual!$I$9 & \" \" & Solicitud.Manual!$I$10 & \" \" & Solicitud.Manual!$M$10","v":"  "}]
[]
["ACTIVIDAD O GIRO DEL NEGOCIO        "]
["Local 1",null,{"$f":"Solicitud.Manual!$E$27","v":""}]
["Local 2",null,{"$f":"Solicitud.Manual!$E$32","v":""}]
["Local 3",null,{"$f":"Solicitud.Manual!$E$37","v":""}]
[]
["DIRECCIÓN DE LOS LOCALES POR ASEGURAR"]
["Local 1",null,{"$f":"Solicitud.Manual!$C$47 & \" \" & Solicitud.Manual!$C$48 & \" \" &Solicitud.Manual!$C$46","v":"  "}]
["Local 2",null,{"$f":"Solicitud.Manual!$G$47 & \" \" & Solicitud.Manual!$G$48 & \" \" &Solicitud.Manual!$G$46","v":"  "}]
["Local 3",null,{"$f":"Solicitud.Manual!$K$47 & \" \" & Solicitud.Manual!$K$48 & \" \" &Solicitud.Manual!$K$46","v":"  "}]
[]
["PROTECCIÓN PARA NEGOCIO",null,null,null,null,null,null,null,null,null,null,null,null,null,"OK"]
[]
["SECCIÓN INCENDIO Y LÍNEAS ALIADAS"]
[]
["A. MATERIA DEL SEGURO"]
["Toda propiedad, , comprendiendo también maquinaria, equipos fijo, equipo móviles dentro y fuera de los predios asegurados, sea de propiedad del ASEGURADO y/o de terceros que se encuentren bajo su responsabilidad, supervisión , control y custodia  siempre que formen parte de los Valores Declarados en la Póliza, en locales propios y/o de terceros señalados en póliza, en forma permanente o temporal incluyendo bienes a la intemperie (siempre que debido a su naturaleza, deban estar bajo esa condición)."]
[]
[]
[]
["B. MODALIDAD DE ASEGURAMIENTO"]
["A Valor Total"]
[]
[]
["C. BIENES ASEGURADOS Y VALORES DECLARADOS"]
[null,null,null,null,null,"Local 1",null,null,"Local 2",null,null,"Local 3",null,null,"OK"]
[null,null,null,null,null,"Valor Declarado",null,null,"Valor Declarado",null,null,"Valor Declarado"]
[null,null,null,null,null,"Total","Endosado",null,"Total","Endosado",null,"Total","Endosado"]
["Edificio y/o Instalaciones fijas (sin considerar el valor del terreno)",null,null,null,null,{"$f":"IF(CoberturasaElegirLocal1!$M$11=\"\",\"\",CoberturasaElegirLocal1!$M$11)","v":""},{"$f":"IF(CoberturasaElegirLocal1!$N$11=\"\",\"\",CoberturasaElegirLocal1!$N$11)","v":""},null,{"$f":"IF(CoberturasaElegirLocal2!$M$11=\"\",\"\",CoberturasaElegirLocal2!$M$11)","v":""},{"$f":"IF(CoberturasaElegirLocal2!$N$11=\"\",\"\",CoberturasaElegirLocal2!$N$11)","v":""},null,{"$f":"IF(CoberturasaElegirLocal3!$M$11=\"\",\"\",CoberturasaElegirLocal3!$M$11)","v":""},{"$f":"IF(CoberturasaElegirLocal3!$N$11=\"\",\"\",CoberturasaElegirLocal3!$N$11)","v":""}]
["Instalaciones Fijas",null,null,null,null,{"$f":"IF(CoberturasaElegirLocal1!$M$12=\"\",\"\",CoberturasaElegirLocal1!$M$12)","v":""},{"$f":"IF(CoberturasaElegirLocal1!$N$12=\"\",\"\",CoberturasaElegirLocal1!$N$12)","v":""},null,{"$f":"IF(CoberturasaElegirLocal2!$M$12=\"\",\"\",CoberturasaElegirLocal2!$M$12)","v":""},{"$f":"IF(CoberturasaElegirLocal2!$N$12=\"\",\"\",CoberturasaElegirLocal2!$N$12)","v":""},null,{"$f":"IF(CoberturasaElegirLocal3!$M$12=\"\",\"\",CoberturasaElegirLocal3!$M$12)","v":""},{"$f":"IF(CoberturasaElegirLocal3!$N$12=\"\",\"\",CoberturasaElegirLocal3!$N$12)","v":""}]
["Mobiliario y/o Contenido propios del giro",null,null,null,null,{"$f":"IF(CoberturasaElegirLocal1!$M$13=\"\",\"\",CoberturasaElegirLocal1!$M$13)","v":""},{"$f":"IF(CoberturasaElegirLocal1!$N$13=\"\",\"\",CoberturasaElegirLocal1!$N$13)","v":""},null,{"$f":"IF(CoberturasaElegirLocal2!$M$13=\"\",\"\",CoberturasaElegirLocal2!$M$13)","v":""},{"$f":"IF(CoberturasaElegirLocal2!$N$13=\"\",\"\",CoberturasaElegirLocal2!$N$13)","v":""},null,{"$f":"IF(CoberturasaElegirLocal3!$M$13=\"\",\"\",CoberturasaElegirLocal3!$M$13)","v":""},{"$f":"IF(CoberturasaElegirLocal3!$N$13=\"\",\"\",CoberturasaElegirLocal3!$N$13)","v":""}]
["Existencias propias del giro del negocio",null,null,null,null,{"$f":"IF(CoberturasaElegirLocal1!$M$14=\"\",\"\",CoberturasaElegirLocal1!$M$14)","v":""},{"$f":"IF(CoberturasaElegirLocal1!$N$14=\"\",\"\",CoberturasaElegirLocal1!$N$14)","v":""},null,{"$f":"IF(CoberturasaElegirLocal2!$M$14=\"\",\"\",CoberturasaElegirLocal2!$M$14)","v":""},{"$f":"IF(CoberturasaElegirLocal2!$N$14=\"\",\"\",CoberturasaElegirLocal2!$N$14)","v":""},null,{"$f":"IF(CoberturasaElegirLocal3!$M$14=\"\",\"\",CoberturasaElegirLocal3!$M$14)","v":""},{"$f":"IF(CoberturasaElegirLocal3!$N$14=\"\",\"\",CoberturasaElegirLocal3!$N$14)","v":""}]
["Maquinaria propia del giro del negocio",null,null,null,null,{"$f":"IF(CoberturasaElegirLocal1!$M$15=\"\",\"\",CoberturasaElegirLocal1!$M$15)","v":""},{"$f":"IF(CoberturasaElegirLocal1!$N$15=\"\",\"\",CoberturasaElegirLocal1!$N$15)","v":""},null,{"$f":"IF(CoberturasaElegirLocal2!$M$15=\"\",\"\",CoberturasaElegirLocal2!$M$15)","v":""},{"$f":"IF(CoberturasaElegirLocal2!$N$15=\"\",\"\",CoberturasaElegirLocal2!$N$15)","v":""},null,{"$f":"IF(CoberturasaElegirLocal3!$M$15=\"\",\"\",CoberturasaElegirLocal3!$M$15)","v":""},{"$f":"IF(CoberturasaElegirLocal3!$N$15=\"\",\"\",CoberturasaElegirLocal3!$N$15)","v":""}]
["Equipos electrónicos propios del giro del negocio",null,null,null,null,{"$f":"IF(CoberturasaElegirLocal1!$M$16=\"\",\"\",CoberturasaElegirLocal1!$M$16)","v":""},{"$f":"IF(CoberturasaElegirLocal1!$N$16=\"\",\"\",CoberturasaElegirLocal1!$N$16)","v":""},null,{"$f":"IF(CoberturasaElegirLocal2!$M$16=\"\",\"\",CoberturasaElegirLocal2!$M$16)","v":""},{"$f":"IF(CoberturasaElegirLocal2!$N$16=\"\",\"\",CoberturasaElegirLocal2!$N$16)","v":""},null,{"$f":"IF(CoberturasaElegirLocal3!$M$16=\"\",\"\",CoberturasaElegirLocal3!$M$16)","v":""},{"$f":"IF(CoberturasaElegirLocal3!$N$16=\"\",\"\",CoberturasaElegirLocal3!$N$16)","v":""}]
["Lucro Cesante – Cédula A - Costos fijos",null,null,null,null,{"$f":"IF(CoberturasaElegirLocal1!$M$17=\"\",\"\",CoberturasaElegirLocal1!$M$17)","v":""},null,null,{"$f":"IF(CoberturasaElegirLocal2!$M$17=\"\",\"\",CoberturasaElegirLocal2!$M$17)","v":""},null,null,{"$f":"IF(CoberturasaElegirLocal3!$M$17=\"\",\"\",CoberturasaElegirLocal3!$M$17)","v":""}]
["TOTAL VALOR DECLARADO (Máximo hasta 2'000,000 USD por local)",null,null,null,null,{"$f":"IF(CoberturasaElegirLocal1!$M$18=\"\",\"\",CoberturasaElegirLocal1!$M$18)","v":""},{"$f":"IF(OR(CoberturasaElegirLocal1!$N$18=\"\",CoberturasaElegirLocal1!$N$18=0),\"\",CoberturasaElegirLocal1!$N$18)","v":""},null,{"$f":"IF(CoberturasaElegirLocal2!$M$18=\"\",\"\",CoberturasaElegirLocal2!$M$18)","v":""},{"$f":"IF(OR(CoberturasaElegirLocal2!$N$18=\"\",CoberturasaElegirLocal2!$N$18=0),\"\",CoberturasaElegirLocal2!$N$18)","v":""},null,{"$f":"IF(CoberturasaElegirLocal3!$M$18=\"\",\"\",CoberturasaElegirLocal3!$M$18)","v":""},{"$f":"IF(OR(CoberturasaElegirLocal3!$N$18=\"\",CoberturasaElegirLocal3!$N$18=0),\"\",CoberturasaElegirLocal3!$N$18)","v":""}]
[]
[]
[]
[]
["D. COBERTURAS Y SUMAS ASEGURADAS",null,null,null,null,"Local 1",null,null,"Local 2",null,null,"Local 3",null,null,"OK"]
["COBERTURA ",null,null,null,null,"Suma Asegurada US$",null,null,"Suma Asegurada US$",null,null,"Suma Asegurada US$"]
["Todo Riesgo Incendio y Líneas Aliadas",null,null,null,null,{"$f":"IF(SUM(F50)<>0,SUM(F50),\"\")","v":""},null,null,{"$f":"IF(SUM(I50)<>0,SUM(I50),\"\")","v":""},null,null,{"$f":"IF(SUM(L50)<>0,SUM(L50),\"\")","v":""}]
["Límite Único, Combinado y en agregado anual para Todo Riesgo Incendio y Líneas Aliadas"]
[]
[]
[]
[]
[null,null,null,null,null,null,null,null,null,null,null,null,null,null,"OK"]
[]
["E. SUBLÍMITES"]
[null,null,null,null,null,"Local 1",null,null,"Local 2",null,null,"Local 3"]
[null,"Sublímite*",null,null,null,"Límite",null,null,"Límite",null,null,"Límite"]
[null,"Huelga, Motín, Conmoción Civil, Daño Malicioso, Vandalismo y /o Terrorismo en el agregado por vigencia.(Límite Único, Combinado y en agregado anual)",null,null,null,{"$f":"F57","v":""},null,null,{"$f":"I57","v":""},null,null,{"$f":"L57","v":""}]
[]
[null,"Gastos Extraordinarios: (Límite Único y Combinado), tales como:\n- Honorarios de Arquitectos, topógrafos e Ingenieros\n- Documentos y Modelos\n- Remoción de Escombros",null,null,null,{"$f":"IF(ISERROR(IF(0.2*F57>400000,400000,0.2*F57)),0,(IF(0.2*F57>400000,400000,0.2*F57)))","v":0},null,null,{"$f":"IF(ISERROR(IF(0.2*I57>400000,400000,0.2*I57)),0,(IF(0.2*I57>400000,400000,0.2*I57)))","v":0},null,null,{"$f":"IF(ISERROR(IF(0.2*L57>400000,400000,0.2*L57)),0,(IF(0.2*L57>400000,400000,0.2*L57)))","v":0}]
[]
[]
[]
[null,"Cobertura Automática para Nuevas Adquisiciones, máximo 30 días para declaración a PACIFICO.\nAplica sólo si cuenta con contenido y equipos y maquinaria",null,null,null,{"$f":"IF(ISERROR(IF(0.2*F57>100000,100000,0.2*F57)),0,IF(0.2*F57>100000,100000,0.2*F57))","v":0},null,null,{"$f":"IF(ISERROR(IF(0.2*I57>100000,100000,0.2*I57)),0,IF(0.2*I57>100000,100000,0.2*I57))","v":0},null,null,{"$f":"IF(ISERROR(IF(0.2*L57>100000,100000,0.2*L57)),0,IF(0.2*L57>100000,100000,0.2*L57))","v":0}]
[]
[]
[null,"Rotura Accidental de Vidrios, Cristales y/o Avisos luminosos. Aplica para contenido y edificación.",null,null,null,{"$f":"IF(ISERROR(IF(0.1*F57>5000,5000,0.1*F57)),0,IF(0.1*F57>5000,5000,0.1*F57))","v":0},null,null,{"$f":"IF(ISERROR(IF(0.1*I57>5000,5000,0.1*I57)),0,IF(0.1*I57>5000,5000,0.1*I57))","v":0},null,null,{"$f":"IF(ISERROR(IF(0.1*L57>5000,5000,0.1*L57)),0,IF(0.1*L57>5000,5000,0.1*L57))","v":0}]
[]
[null,"Gastos Extras",null,null,null,{"$f":"IF(ISERROR(IF(0.2*F57>400000,400000,0.2*F57)),0,IF(0.2*F57>400000,400000,0.2*F57))","v":0},null,null,{"$f":"IF(ISERROR(IF(0.2*I57>400000,400000,0.2*I57)),0,IF(0.2*I57>400000,400000,0.2*I57))","v":0},null,null,{"$f":"IF(ISERROR(IF(0.2*L57>400000,400000,0.2*L57)),0,IF(0.2*L57>400000,400000,0.2*L57))","v":0}]
[null,"Refrigeración (L.A.A.)**",null,null,null,{"$f":"IF(ISERROR(IF(DatosdelNegocioLocal1!$AH$5=\"A\",20000,\"\")),0,(IF(DatosdelNegocioLocal1!$AH$5=\"A\",20000,\"\")))","v":""},null,null,{"$f":"IF(ISERROR(IF(DatosdelNegocioLocal1!$AH$5=\"A\",20000,\"\")),0,(IF(DatosdelNegocioLocal1!$AH$5=\"A\",20000,\"\")))","v":""},null,null,{"$f":"IF(ISERROR(IF(DatosdelNegocioLocal1!$AH$5=\"A\",20000,\"\")),0,(IF(DatosdelNegocioLocal1!$AH$5=\"A\",20000,\"\")))","v":""}]
[null,"*: Foman parte de la Suma Asegurada, no son adicionales"]
[null,"**: $ 5,000 por evento. $ 20,000 en agregado anual."]
[]
["F. CONDICIONADOS Y CLÁUSULAS APLICABLES A ESTA SECCIÓN",null,null,null,null,null,null,null,null,null,null,null,null,null,"OK"]
[]
["990000 - Claúsulas Generales de Contratación para Riesgos Generales"]
["Condicionado General Multi-Riesgo Negocios 2016"]
["010005 - Cláusula Todo Riesgo."]
["010027 - Claúsula para Pérdidas y Daños por Huelga, Motín y Conmoción Civil."]
["010028 - Claúsula para Pérdidas o Daños por Vandalismo, Terrorismo y Daño Malicioso."]
["010029 - Claúsula para Gastos Extras"]
["010024 - Claúsula para Gastos Extraordinarios"]
["010006 - Claúsula de Refrigeración."]
["010010 - Cláusula de cobertura automática por nuevas adquisiciones."]
["010003 - Cláusula de rotura de cristales y/o vidrios."]
["990001 - Cláusula de Terceros."]
["990003 - Cláusula de rehabilitación automática de la suma asegurada (condición PPS)."]
["010038 - Claúsula de reemplazo."]
["010012 - Claúsula de Traslado temporal. "]
["010011 - Claúsula de Propiedades fuera de control del Asegurado. "]
["010013 - Claúsula de Errores u omisiones."]
["010004 -Cláusula de transporte incidental."]
["010037 Cláusula de 72 horas"]
["011000 - Condicionado general de lucro cesante por incendio"]
["011001 – CL. Para lucro cesante forma inglesa cédula A"]
["010025 - Clausula para daños causados por terremoto, temblor, erupción volcánica, y/o  fuego subterráneo, marejada, maremoto y tsunami"]
["Asistencias para el negocio."]
[]
["G. DEDUCIBLES (POR TODA Y CADA PÉRDIDA)",null,null,null,null,null,null,null,null,null,null,null,null,null,"OK"]
[]
["Terremoto, temblor, erupción volcánica, fuego subterráneo, maremoto (tsunami), salida mar, marejada u oleaje: 1% del valor declarado del predio afectado y/o su contenido y/o sus existencias, mínimo US$ 1,000"]
[]
["Otros riesgos de la naturaleza: 1% del valor declarado del predio afectado y/o su contenido y/o sus existencias, mínimo US$ 1,000"]
["Huelga, conmoción civil, asonada, daño malicioso y vandalismo, sabotaje y/o terrorismo: 10% del monto indemnizable mínimo US$  1,000"]
[]
["Rotura Accidental de Vidrios, Cristales y/o Avisos Luminosos: 10% del monto indemnizable mínimo US$ 50.00"]
["Gastos Extras:  3 días"]
["Otros riesgos:  5 % del Monto Indemnizable, mínimo US$ 500.00"]
["Lucro Cesante, 5 días"]
["Transporte Incidental: 10% del monto indemnizable mínimo US$ 100.00"]
["Refrigeración: 10.00% del monto indemnizable, mínimo US$ 200.00"]
[]
[]
[]
["PROTECCIÓN PARA NEGOCIO",null,null,null,null,null,null,null,null,null,null,null,null,null,"OK"]
[]
[]
["H. CONDICIONES ESPECIALES APLICABLES ESTA SECCIÓN"]
[]
["Las coberturas adicionales forman parte del límite principal"]
["La presente sección no cubre Lucro Cesante Contingente en cualquiera de sus modalidades. "]
["Se entiende como costo fijo para la cobertura de Lucro Cesante: Alquileres, sueldos de personal estable en planilla, mantenimiento, servicios de telefonía fija, agua y luz."]
["Las siguientes cláusulas son de aplicación siempre y cuando la presente poliza se encuentre endosada a algún banco y/o entidad financiera:\n- clausula de reemplazo hasta 3 años de antiguedad.\n- traslado temporal. \n- propiedades fuera de control del asegurado. \n- errores u omisiones."]
[]
[]
[]
[]
["La clausula de refrigeración es de aplicacion siempre y cuando corresponda a cualquiera de las siguientes actividades: restaurantes, hoteles,panaderías, heladerías, carnicerías y bodegas."]
[]
["I. GARANTÍAS APLICABLES ESTA SECCIÓN",null,null,null,null,null,null,null,null,null,null,null,null,null,"OK"]
[]
["Queda entendido y convenido bajo pena para el asegurado de perder todo derecho a indemnización procedente de la presente póliza, que este seguro se formaliza en virtud a lo siguiente:\nQue el asegurado debe cumplir con las siguientes garantías mínimas para incendio.\n1. Todas las llaves eléctricas deben estar instaladas en tableros con tapa y nunca al aire libre, deben ser del tipo electro magnéticas y deben estar dimensionadas de acuerdo a las cargas presentes en el local y al correspondiente circuito eléctrico que controlan. deberán ser siempre mediante enchufes adecuados y jamás directamente con cables.\n2. Las instalaciones eléctricas deben ser tendidas dentro de tubos protectores de PVC empotrados, o expuestos debidamente fijados a la pared, piso o techo según corresponda. en caso de tratarse de cables blindados o vulcanizados diseñados especialmente para ser tendidos al aire libre, deben estar sobre canaletas adecuadamente habilitadas.\n3. Contar con extintores vigentes y operativos. asimismo, todo el personal que labora en el local deberá recibir instrucción sobre la utilización de extintores por lo menos una vez al año, la cual se puede realizar al momento de la recarga de los mismos.\n4. Deberá contar con la licencia de funcionamiento vigente."]
[]
[]
[]
[]
[]
["PROTECCIÓN PARA NEGOCIO",null,null,null,null,null,null,null,null,null,null,null,null,null,"OK"]
[]
[]
["SECCIÓN ROTURA DE MAQUINARIA"]
[]
["A. MATERIA DEL SEGURO"]
[]
["Maquinaria y equipo, fijo y estacionario en general de propiedad del ASEGURADO y/o de terceros que guarden relación con el giro del negocio que se encuentren bajo su responsabilidad, supervisión, control y custodia siempre que formen parte de los Valores Declarados en la Póliza, en el local  señalado en póliza, en forma permanente o temporal  y que sea parte  o contribuyan directa o indirectamente con el proceso productivo o actividad del ASEGURADO."]
[]
[]
[]
[]
["B. MODALIDAD DE ASEGURAMIENTO"]
[]
["A PRIMER RIESGO"]
[]
["C. COBERTURAS Y SUMAS ASEGURADAS",null,null,null,null,null,null,null,null,null,null,null,null,null,"OK"]
[null,null,null,null,null,"Local 1",null,null,"Local 2",null,null,"Local 3"]
[null,"Cobertura",null,null,null,"Suma Asegurada",null,null,"Suma Asegurada",null,null,"Suma Asegurada"]
[null,"Daño Material – Básica ",null,null,null,{"$f":"+CoberturasaElegirLocal1!$N$23","v":""},null,null,{"$f":"+CoberturasaElegirLocal2!$N$23","v":""},null,null,{"$f":"+CoberturasaElegirLocal3!$N$23","v":""}]
[]
[]
["D. SUBLÍMITES",null,null,null,null,null,null,null,null,null,null,null,null,null,"OK"]
[null,null,null,null,null,"Local 1",null,null,"Local 2",null,null,"Local 3"]
[null,"Sub Limites",null,null,null,"Límite US$",null,null,"Límite US$",null,null,"Límite US$"]
[null,"Gastos adicionales por horas extras, trabajo nocturno, trabajo en días festivos, flete expreso, Límite Único y Combinado",null,null,null,"Hasta el 100% de Suma Asegurada, Hasta $ 10,000 ",null,null,"Hasta el 100% de Suma Asegurada, Hasta $ 10,000 ",null,null,"Hasta el 100% de Suma Asegurada, Hasta $ 10,000 "]
[null,"Flete aéreo.",null,null,null,"Hasta el 100% de Suma Asegurada, Hasta $ 10,000 ",null,null,"Hasta el 100% de Suma Asegurada, Hasta $ 10,000 ",null,null,"Hasta el 100% de Suma Asegurada, Hasta $ 10,000 "]
[]
["E. CONDICIONADOS Y CLÁUSULAS APLICABLES A ESTA SECCIÓN:",null,null,null,null,null,null,null,null,null,null,null,null,null,"OK"]
[]
["− 330007 CLÁUSULA PARA CUBRIR GASTOS ADICIONALES POR HORAS EXTRA, TRABAJO NOCTURNO, TRABAJO EN DÍAS FESTIVOS Y FLETE EXPRESO"]
["− 330006 CL.PARA CUBRIR GASTOS ADICIONALES PARA FLETE AÉREO"]
["− 330005 CL. DE EXCLUSIÓN DE EXPLOSIONES DE GASES DE ESCAPE EN CALDERAS Y HORNOS "]
["− 330013 CL. DE AJUSTE DE LA DEPRECIACIÓN PARA LA REPARACIÓN DE MOTORES DE COMBUSTIÓN INTERNA"]
["− 330028 CL.  VALOR NUEVO DE REPOSICION-RM "]
["−  990000 - Claúsulas Generales de Contratación para Riesgos Generales"]
["Condicionado General Multi-Riesgo Negocios."]
["330013 - clausula de ajuste de la depreciación para la reparación de motores de combustión  interna (p. ej. motores de gasolina, motores a gas). (obligatorio)"]
[]
[" - 330012 - ajuste de depreciación en rebobinados maquinas eléctricas. (obligatorio)"]
[]
["F. DEDUCIBLES (POR TODA Y CADA PÉRDIDA)",null,null,null,null,null,null,null,null,null,null,null,null,null,"OK"]
[]
["Daño Material,  10% del monto indemnizable mínimo US$ 500."]
["-      Gastos adicionales por horas extras, trabajo nocturno, trabajo en días festivos, flete expreso. 10% del monto indemnizable mínimo US$ 200"]
["-       Flete Aéreo 10% del monto indemnizable mínimo US$ 200"]
[]
[]
["G. CONDICIONES ESPECIALES APLICABLES ESTA SECCIÓN",null,null,null,null,null,null,null,null,null,null,null,null,null,"OK"]
[]
["La presente  póliza se limita a amparar la maquinaria fija dentro del local declarado."]
["El Valor Declarado debe corresponder al valor de reposición a nuevo del equipo asegurado."]
["Valor Nuevo de reemplazo, aplicables para maquinaria hasta 2 años de antigüedad."]
[]
["H. GARANTÍAS APLICABLES ESTA SECCIÓN"]
[]
["Queda entendido y convenido bajo pena para el asegurado de perder  todo derecho a indemnización procedente de la siguiente  póliza, que  este  seguro se formaliza en virtud de que el asegurado se  comprometa  a cumplir lo siguiente:\nSe debe contar, cumplir y documentar con el programa de Mantenimiento Preventivo, según indicaciones del fabricante para todos los equipos."]
[]
[]
[]
[]
["PROTECCIÓN PARA NEGOCIO",null,null,null,null,null,null,null,null,null,null,null,null,null,"OK"]
[]
[]
["SECCIÓN EQUIPO ELECTRONICO"]
[]
["A. MATERIA DEL SEGURO"]
[]
["Equipos eléctricos y electrónicos instalados, de propiedad del ASEGURADO y/o de terceros que guarden relación con el giro del negocio bajo control, cuidado y custodia del ASEGURADO, dentro del local asegurado que formen parte del Valor Declarado y sea parte o contribuyan directa o indirectamente con el proceso productivo o actividad del ASEGURADO."]
[]
[]
[]
["B. MODALIDAD DE ASEGURAMIENTO"]
[]
["A PRIMER RIESGO"]
[]
["C. COBERTURAS Y SUMAS ASEGURADAS",null,null,null,null,null,null,null,null,null,null,null,null,null,"OK"]
[null,null,null,null,null,"Local 1",null,null,"Local 2",null,null,"Local 3"]
[null,"Coberturas",null,null,null,"Sumas Aseguradas",null,null,"Sumas Aseguradas",null,null,"Sumas Aseguradas"]
[null,"Todo Riesgo Equipo Electrónico Secciones I,II y III – Límite Único y Combinado, período de indemnización Sección III: 06 meses",null,null,null,{"$f":"+CoberturasaElegirLocal1!$N$26","v":""},null,null,{"$f":"+CoberturasaElegirLocal2!$N$26","v":""},null,null,{"$f":"+CoberturasaElegirLocal3!$N$26","v":""}]
[]
[]
[]
["D. SUBLÍMITES",null,null,null,null,null,null,null,null,null,null,null,null,null,"OK"]
[null,null,null,null,null,"Local 1",null,null,"Local 2",null,null,"Local 3"]
[null,"Sublímite",null,null,null,"Límite",null,null,"Límite",null,null,"Límite"]
[null,"Equipos Móviles y Portátiles fuera del predio limitado a Laptops y/o notebooks US$ 3,000 por evento y en el Agregado por vigencia.",null,null,null,{"$f":"CoberturasaElegirLocal1!$N$27","v":""},null,null,{"$f":"CoberturasaElegirLocal2!$N$27","v":""},null,null,{"$f":"CoberturasaElegirLocal3!$N$27","v":""}]
[]
[]
[null,"Gastos adicionales por horas extras, trabajo nocturno, trabajo en días festivos, flete expreso – por evento y en el Agregado por vigencia, Límite Único y Combinado",null,null,null,"Hasta el 100% de Suma Asegurada, Hasta $ 5,000 ",null,null,"Hasta el 100% de Suma Asegurada, Hasta $ 5,000 ",null,null,"Hasta el 100% de Suma Asegurada, Hasta $ 5,000 "]
[null,"Flete aéreo – por evento y en el Agregado Vigencia",null,null,null,"Hasta el 100% de Suma Asegurada, Hasta $ 5,000 ",null,null,"Hasta el 100% de Suma Asegurada, Hasta $ 5,000 ",null,null,"Hasta el 100% de Suma Asegurada, Hasta $ 5,000 "]
[]
["E. CONDICIONADOS Y CLÁUSULAS APLICABLES A ESTA SECCIÓN:",null,null,null,null,null,null,null,null,null,null,null,null,null,"OK"]
[]
["990000 - Claúsulas Generales de Contratación para Riesgos Generales"]
["Condicionado General Multi-Riesgo Negocios."]
["360002 - Cláusula de valor nuevo de reposición."]
["360015 - Cláusula sobre celebración de un contrato de mantenimiento."]
["360008 - Cláusula de obligaciones relativas a equipos de climatización."]
["360027 Cláusula para cubrir gastos adicionales para el flete aéreo."]
[{"$f":"+IF(F234=\"\",\"\",\"Cláusula para equipos móviles y portátiles fuera del predio asegurado.\")","v":""}]
["360023 Cláusula de cobertura de equipos móviles y portátiles fuera de los predios asegurados."]
[]
[]
["F. DEDUCIBLES (POR TODA Y CADA PÉRDIDA)",null,null,null,null,null,null,null,null,null,null,null,null,null,"OK"]
[" "]
["Secciones I y II,  10% del monto indemnizable mínimo US$  200"]
["Sección III : 3  días"]
[{"$f":"+IF(F234=\"\",\"\",\"Equipos Móviles y Portátiles fuera de los predios: 20 % del monto indemnizable mínimo US$ 500\")","v":""}]
["Gastos adicionales por horas extras, trabajo nocturno, trabajo en días festivos, flete expreso. 10% del monto indemnizable mínimo US$ 200"]
["Flete Aéreo 10% del monto indemnizable mínimo US$ 200"]
["Equipo móvil: 20.00% del monto indemnizable, mínimo US$ 500.00"]
["G. CONDICIONES ESPECIALES APLICABLES ESTA SECCIÓN",null,null,null,null,null,null,null,null,null,null,null,null,null,"OK"]
["Contar con duplicado de información backup, para efectos de la Sección II portadores externos de datos, en otro local del asegurado."]
["Se excluyen los daños causados por los programas denominados “virus informáticos”."]
["Se excluye la cobertura de robo para equipos electrónicos.\nLas secciones I,II ,III estan expresadas en limite único y combinado y en agregado anual , periodo de indemnización sección III  6 meses.\nSe otorga cobertura de equipo móviles y portatiles fuera del predio asegurado, para laptops y/o notebooks hasta el 50% del valor asegurado de equipo electrónico, limitado hasta us$ 3,000, limite por evento y en agregado vigencia.\nEl valor declarado debe corresponder al valor de reposición a nuevo del equipo asegurado.\nCláusula de valor nuevo de reposición, hasta 2 años de antigüedad.\nLas coberturas adicionales forman parte del limite principal."]
[]
["H. GARANTÍAS APLICABLES ESTA SECCIÓN",null,null,null,null,null,null,null,null,null,null,null,null,null,"OK"]
["Queda entendido y convenido bajo pena para el asegurado de perder todo derecho a indemnizacion procedente de la presente poliza, que este seguro se formaliza en virtud a lo siguiente:\nQue el asegurado debe cumplir con las siguientes garantias minimas para equipo electronico\nTodos los Equipos deberán contar con Estabilizador de Voltaje operativo."]
["Se debe contar, cumplir y documentar con el programa de Mantenimiento Preventivo, según indicaciones del fabricante para todos los equipos."]
[]
[]
[]
["PROTECCIÓN PARA NEGOCIO",null,null,null,null,null,null,null,null,null,null,null,null,null,"OK"]
[]
[]
["SECCIÓN ROBO"]
[]
["A. MATERIA DEL SEGURO"]
[]
["Contenidos en el local asegurado incluyendo maquinaria y equipos, existencias en general y dinero en efectivo de propiedad del ASEGURADO y/o de terceros que guarden relación con el giro del negocio que se encuentren bajo su responsabilidad, supervisión, control y custodia siempre que formen parte de los Valores Declarados en la Póliza."]
[]
[]
[]
["B. BIENES ASEGURADOS Y VALORES DECLARADOS",null,null,null,null,null,null,null,null,null,null,null,null,null,"OK"]
[null,null,null,null,null,"Local 1",null,null,"Local 2",null,null,"Local 3"]
["Detalle",null,null,null,null,"Valor Declarado","Suma Asegurada Máxima",null,"Valor Declarado","Suma Asegurada Máxima",null,"Valor Declarado","Suma Asegurada Máxima"]
["Edificio (sin considerar el valor del terreno)"]
["Instalaciones fijas",null,null,null,null,{"$f":"+CoberturasaElegirLocal1!$M$31","v":""},null,null,{"$f":"+CoberturasaElegirLocal2!$M$31","v":""},null,null,{"$f":"+CoberturasaElegirLocal3!$M$31","v":""}]
["Mobiliario y/o contenido propios del giro del negocio",null,null,null,null,{"$f":"+CoberturasaElegirLocal1!$M$32","v":""},null,null,{"$f":"+CoberturasaElegirLocal2!$M$32","v":""},null,null,{"$f":"+CoberturasaElegirLocal3!$M$32","v":""}]
["Existencias propias del giro del negocio",null,null,null,null,{"$f":"+CoberturasaElegirLocal1!$M$33","v":""},null,null,{"$f":"+CoberturasaElegirLocal2!$M$33","v":""},null,null,{"$f":"+CoberturasaElegirLocal3!$M$33","v":""}]
["Maquinaria propia del giro del negocio",null,null,null,null,{"$f":"+CoberturasaElegirLocal1!$M$34","v":""},null,null,{"$f":"+CoberturasaElegirLocal2!$M$34","v":""},null,null,{"$f":"+CoberturasaElegirLocal3!$M$34","v":""}]
["Equipo electrónico fijo",null,null,null,null,{"$f":"+CoberturasaElegirLocal1!$M$35","v":""},null,null,{"$f":"+CoberturasaElegirLocal2!$M$35","v":""},null,null,{"$f":"+CoberturasaElegirLocal3!$M$35","v":""}]
["Dinero en Tránsito (LAA)",null,null,null,null,"---------",{"$f":"+CoberturasaElegirLocal1!$N$38","v":""},null,"---------",{"$f":"+CoberturasaElegirLocal2!$N$38","v":""},null,"---------",{"$f":"+CoberturasaElegirLocal3!$N$38","v":""}]
["Dinero y/o valores dentro del local (caja chica y/o caja registradora) solo en horas laborables (LAA)",null,null,null,null,{"$f":"+CoberturasaElegirLocal1!$M$36","v":"---------"},{"$f":"+CoberturasaElegirLocal1!$N$36","v":""},null,{"$f":"+CoberturasaElegirLocal2!$M$36","v":"---------"},{"$f":"+CoberturasaElegirLocal2!$N$36","v":""},null,{"$f":"+CoberturasaElegirLocal3!$M$36","v":"---------"},{"$f":"+CoberturasaElegirLocal3!$N$36","v":""}]
["Total:",null,null,null,null,{"$f":"IF(SUM(F286:F290)=0,\"\",SUM(F286:F290))","v":""},{"$f":"IF(LEN(F293)>0,IF(F293>100000,100000,F293),\"\")","v":""},null,{"$f":"IF(SUM(I286:I290)=0,\"\",SUM(I286:I290))","v":""},{"$f":"IF(LEN(I293)>0,IF(I293>100000,100000,I293),\"\")","v":""},null,{"$f":"IF(SUM(L286:L290)=0,\"\",SUM(L286:L290))","v":""},{"$f":"IF(LEN(L293)>0,IF(L293>100000,100000,L293),\"\")","v":""}]
[]
["C. MODALIDAD DE ASEGURAMIENTO",null,null,null,null,null,null,null,null,null,null,null,null,null,"OK"]
[]
["A PRIMER RIESGO"]
[]
["D. CONDICIONADOS Y CLÁUSULAS APLICABLES A ESTA SECCIÓN:"]
[]
["990001 - Cláusula de terceros"]
["410006 - Cláusula de garantía para dinero y valores en tránsito"]
[{"$f":"+IF(G292=\"\",\"\",\"410004 - Cláusula para cubrir dinero en efectivo y o valores dentro del local asegurado, en Agregado por Vigencia.\")","v":""}]
[{"$f":"+IF(G291=\"\",\"\",\"410003 - Cláusula de Dinero en Efectivo y Valores en Tránsito desde Oficinas del Asegurado.\")","v":""}]
[]
["E. DEDUCIBLES (POR TODA Y CADA PÉRDIDA)",null,null,null,null,null,null,null,null,null,null,null,null,null,"OK"]
[]
["Robo y/o Asalto de Activos y/o Existencias: 10.00 % del monto indemnizable, mínimo US$ 500 toda y cada pérdida."]
[{"$f":"+IF(G291=\"\",\"\",\"Dinero en Tránsito y Dinero en Caja Chica: 10% del monto indemnizable mínimo USD250.00\")","v":""}]
[]
["F. CONDICIONES ESPECIALES APLICABLES ESTA SECCIÓN",null,null,null,null,null,null,null,null,null,null,null,null,null,"OK"]
[]
["No se ampara los bienes que se encuentran en patios, jardines, terrazas, azoteas que no tengan más defensa que muros perimétricos o en vitrinas fijas o movibles que se hallen colocadas fuera del edificio o de los ámbitos que constituyen el lugar del seguro."]
[]
[]
["No cubre almacenes de campo."]
[]
["G. GARANTÍAS APLICABLES ESTA SECCIÓN",null,null,null,null,null,null,null,null,null,null,null,null,null,"OK"]
[]
["1. Si la puerta es de una sola hoja, como mínimo dispondrá de una chapa sólida que se reforzará a su base o estará soldada a la misma; debe ser de no menos de 2 golpes.  Adicionalmente, la puerta de reja deberá protegerse con dos (02) candados con media luna protectora de bronce o puente protector metálico.  Si la puerta es de dos hojas; las medidas de seguridad serán las que se han mencionado, agregándole a la reja dos cerrojos verticales (uno al marco superior y otro al inferior) en cada hoja; en los que se colocarán un candado con media luna protectora de bronce."]
[]
[]
[]
[]
[]
[]
[]
[]
[]
["PROTECCIÓN PARA NEGOCIO",null,null,null,null,null,null,null,null,null,null,null,null,null,"OK"]
[]
[]
[]
["2. Cuando el local cuente con cortinas enrollables que den hacia la calle, se deberá cumplir con los siguientes requisitos:\nA. Cada una de las cortinas metálicas enrollables deberá contar como mínimo con dos (2) argollas de fierro ancladas al piso, las cuales se sujetarán interiormente a las cortinas metálicas con un candado media luna protectora de bronce.\nB. Si la cortina dispone de puerta chica, ésta deberá contar como mínimo con dos chapas de tres golpes o más, y adicionalmente dos candados protegidos con puente protector o media luna protectora de bronce:\nC. Los carriles de la cortina enrollable deben estar reforzados tanto por dentro como por fuera, con ángulos de fierro de no menos de 3 pulgadas de ancho y como mínimo 1.50 metros con respecto al nivel del suelo.  Esta medida de seguridad no es necesario adoptarla si la cortina enrollable dispone de una sobre reja de fierro exteriormente."]
[]
[]
[]
[]
[]
[]
[]
["PROTECCIÓN PARA NEGOCIO",null,null,null,null,null,null,null,null,null,null,null,null,null,"OK"]
[]
[]
["SECCIÓN RESPONSABILIDAD CIVIL"]
[]
["A. MATERIA DEL SEGURO"]
["Sujeto a todos los términos y condiciones que forman parte de la presente Póliza, LA COMPAÑÍA cubre al ASEGURADO contra las reclamaciones de Terceros por concepto de Responsabilidad Civil Extracontractual, exclusivamente a consecuencia de Daños Personales y/o Daños Materiales causados involuntariamente a dichos Terceros por un accidente ocurrido durante la vigencia de la Póliza, como resultado directo de las actividades o negocios declarados en las Condiciones Particulares."]
[]
[]
[]
[]
["B. BASE DE COBERTURA"]
[]
["OCURRENCIA"]
[]
["B. COBERTURAS Y SUMAS ASEGURADAS",null,null,null,null,null,null,null,null,null,null,null,null,null,"OK"]
[null,null,null,null,null,"Local 1",null,null,"Local 2",null,null,"Local 3"]
[null,"Cobertura",null,null,null,"Suma Asegurada",null,null,"Suma Asegurada",null,null,"Suma Asegurada"]
[null,"Responsabilidad Civil Extracontractual en Límite Agregado por Vigencia.",null,null,null,{"$f":"+CoberturasaElegirLocal1!$N$40","v":50000},null,null,{"$f":"+CoberturasaElegirLocal2!$N$40","v":""},null,null,{"$f":"+CoberturasaElegirLocal3!$N$40","v":""}]
[]
[]
["C. SUBLÍMITES",null,null,null,null,null,null,null,null,null,null,null,null,null,"OK"]
[]
[null,"Cobertura",null,null,null,"Suma Asegurada",null,null,"Suma Asegurada",null,null,"Suma Asegurada"]
[null,"Alimentos y bebidas USD 5,000 POR EVENTO Y HASTA USD 20,000, como parte del límite principal y en Agregado Anual\nAplica para opción Hoteles y Restaurantes",null,null,null,{"$f":"+IF(F360=\"\",\"\",IF(OR(DatosdelNegocioLocal1!$AH$6=13,DatosdelNegocioLocal1!$AH$6=21),\"Aplica\",\"No Aplica\"))","v":"No Aplica"},null,null,{"$f":"+IF(I360=\"\",\"\",IF(OR(DatosdelNegocioLocal2!$AH$6=13,DatosdelNegocioLocal2!$AH$6=21),\"Aplica\",\"No Aplica\"))","v":""},null,null,{"$f":"+IF(L360=\"\",\"\",IF(OR(DatosdelNegocioLocal3!$AH$6=13,DatosdelNegocioLocal3!$AH$6=21),\"Aplica\",\"No Aplica\"))","v":""}]
[]
[]
[null,"Responsabilidad de Inkeepers USD 5,000 POR EVENTO Y HASTA USD 20,000 como parte del límite principal y en Agregado Anual\nAplica para opción Hoteles",null,null,null,{"$f":"+IF(F360=\"\",\"\",IF(OR(DatosdelNegocioLocal1!$AH$6=13),\"Aplica\",\"No Aplica\"))","v":"No Aplica"},null,null,{"$f":"+IF(I360=\"\",\"\",IF(OR(DatosdelNegocioLocal2!$AH$6=13),\"Aplica\",\"No Aplica\"))","v":""},null,null,{"$f":"+IF(L360=\"\",\"\",IF(OR(DatosdelNegocioLocal3!$AH$6=13),\"Aplica\",\"No Aplica\"))","v":""}]
[]
[]
[null,"Responsabilidad Civil Patronal en exceso de las pólizas de ley, limitado hasta USD 25,000 LUC.",null,null,null,{"$f":"+IF(F360=\"\",\"\",\"Aplica\")","v":"Aplica"},null,null,{"$f":"+IF(I360=\"\",\"\",\"Aplica\")","v":""},null,null,{"$f":"+IF(L360=\"\",\"\",\"Aplica\")","v":""}]
[]
[null,"Responsabilidad Civil Contractual hasta el 100% de la suma asegurada de la RC extracontractual limitado hasta USD 100,000 como parte del limite principal y en Agregado Anual",null,null,null,{"$f":"+IF(F360=\"\",\"\",\"Aplica\")","v":"Aplica"},null,null,{"$f":"+IF(I360=\"\",\"\",\"Aplica\")","v":""},null,null,{"$f":"+IF(L360=\"\",\"\",\"Aplica\")","v":""}]
[]
[]
["D. CONDICIONADOS Y CLÁUSULAS APLICABLES A ESTA SECCIÓN:",null,null,null,null,null,null,null,null,null,null,null,null,null,"OK"]
[]
["990000 - Claúsulas Generales de Contratación para Riesgos Generales"]
["Condicionado General Multi-Riesgo Negocios."]
["530006 - Cláusula de Responsabilidad Civil de locales y operaciones"]
["530010 - Cláusula de Responsabilidad Civil por incendio y/o explosión y/o agua y/o humo. "]
["530017 - Cláusula de Responsabilidad Civil por el empleo de ascensores, montacargas, grúas y escaleras mecánicas."]
["530004 - Claúsula de Responsabilidad Civil de Alimentos y Bebidas."]
["530008 - Claúsula de Responsabilidad Civil para Restaurantes, Bares, Cafés y similares."]
["530011 - Claúsula de Establecimientos de Baños Turcos, Baños públicos, saunas y similares."]
["530030 - Claúsula de Responsabilidad Civil de Oficinas, Bancos, Empresas de Seguros y similares."]
["530027 - Claúsula de Responsabilidad Civil de Hoteleros(Inkeeper´s Liability)"]
["530005 - Claúsula de Responsabilidad Civil de Colegios, universidades e institutos de enseñanza."]
["530015 - Claúsula de Responsabilidad Civil de Peluquerias, Institutos y Salones de belleza."]
["530018 - Claúsula de Responsabilidad Civil durante eventos sociales y culturales."]
["530019 - Cláusula de Responsabilidad Civil Patronal."]
["530022 - Cláusula de Responsabilidad Civil Contractual"]
[]
[]
["E. DEDUCIBLES (POR TODA Y CADA PÉRDIDA)",null,null,null,null,null,null,null,null,null,null,null,null,null,"OK"]
[]
["10% del monto indemnizable mínimo US$ 500 todo y cada reclamo."]
["(Inkeeper´s Liability) 10% del monto indemnizable mínimo US$ 300 todo y cada reclamo."]
[]
["Para hoteles y restaurantes hemos incoporado la Responsabilidad Civil de delivery como parte de la suma asegurada de la Responsabilidad Civil extracontractual."]
["La Responsabilidad Civil para delivery es 20,000 dólares por evento hasta consumir el limite de la Responsabilidad Civil extracontractual."]
[]
["PROTECCIÓN PARA NEGOCIO",null,null,null,null,null,null,null,null,null,null,null,null,null,"OK"]
[]
[]
["F. CONDICIONES ESPECIALES APLICABLES ESTA SECCIÓN"]
[]
["EL LIMITE ASEGURADO ES UNICO EN AGREGADO ANUAL."]
[]
[]
["La “Cláusula de Responsabilidad Civil de Alimentos y bebidas” es de aplicación únicamente para los siguientes rubros: Restaurantes, Hoteles, Panaderías"]
[]
["La “Cláusula de Responsabilidad Civil de Hoteleros” (Inkeeper´s Liability es de aplicación únicamente para el rubro de Hoteles."]
["La Cláusula de Responsabilidad Civil de Oficinas, Bancos, Empresas de Seguros y similares es de aplicación únicamente para el rubro de Oficinas."]
[]
["La “Cláusula de Responsabilidad Civil de Colegios, universidades e Institutos de enseñanza”, es de aplicación únicamente para Colegios."]
[]
["La “Cláusula de Responsabilidad Civil de Peluquerías, Institutos y Salones de Belleza”, es de aplicación únicamente para Peluquerías y Salones de Belleza."]
[]
[]
["G. EXCLUSIONES"]
[]
["RC de productos"]
["RC derivada de actos delictivos cometidos por terceras personas"]
["RC profesional / errores y omisiones "]
["Multas y penalidades"]
["Rehabilitación automática de la suma asegurada"]
["Daños financieros puros"]
["Incumplimientos contractuales y compromiso asumido por contratos"]
["D & O"]
["Reclamaciones por difamación, calumnia, injuria, delitos contra el honor"]
["Fallas de proveedores"]
["Caso fortuito o fuerza mayor"]
["Reclamos y/o demandas provenientes del extranjero"]
["Transporte y almacenamiento de mercadería peligrosa incluyendo hidrocarburos"]
["Bienes de terceros bajo cargo, custodia y control"]
["Daños a los bienes o propiedades de los asegurados"]
["RC derivada y relacionada con la violación de la propiedad intelectual, competencia desleal,\npublicidad adversa o perjudicial contra competidores"]
[]
["RC derivada de errores informáticos, virus, internet"]
["Trabajos terminados."]
["Daños a la carga y al medio transportador"]
["Contaminación gradual"]
["Garantía, retirada e ineficiencia de productos"]

{"sheet":"Slip Final","index":17,"n_rows":79,"n_cols":30,"rows_kept":79,"cut":false,"hidden":false,"merged":[[42,0,44,12],[63,0,63,12],[57,0,60,12],[56,0,56,12],[54,0,55,12],[52,0,53,11],[78,0,78,1],[18,0,19,12],[20,0,20,12],[22,0,22,12],[24,0,24,12],[25,0,25,12],[26,0,26,12],[64,0,66,12],[29,0,29,12],[31,0,32,12],[41,0,41,12],[36,0,36,12],[38,0,39,12],[51,0,51,12],[49,0,50,12],[48,0,48,12],[16,0,17,12],[33,0,34,12],[1,0,1,12],[4,0,4,12],[8,0,9,12],[10,0,10,12],[11,0,12,12],[13,0,14,12],[27,0,27,12]]}
[]
["PROTECCIÓN PARA NEGOCIO",null,null,null,null,null,null,null,null,null,null,null,null,null,"OK"]
[]
[]
["ASISTENCIAS"]
[]
["SERVICIOS MÉDICOS PARA EL NEGOCIO"]
[]
["Servicios de Ambulancia por Emergencia o Accidente, disponible las 24 horas del día todo el año, hasta un máximo de 03 atenciones por año de vigencia de la póliza, hasta S/. 350 por evento."]
[]
["Servicio de “Aló doctor”  para el asegurado y empleados, disponible las 24 horas del día todo el año, sin límite."]
["Servicios de “Doctor a domicilio”, para el asegurado y empleados, disponible las 24 horas del día, todo el año con copago de S/. 35 (no incluye medicinas ni exámenes médicos), sin límite.",null,null,null,null,null,null,null,null,null,null,null,null,null,null,null,null,null,null,null,null,null,null,null,null,null,null,null,null,2]
[]
["Un chequeo preventivo anual gratuito (incluye 02 exámenes básicos al escoger entre: colesterol, glucosa o triglicéridos), al cual podrá acceder comunicándose al  teléfono  Lima y provincias: (01) 415-1515"]
[]
[]
["ASISTENCIAS DE SERVICIOS PARA EL NEGOCIO"]
[]
["Servicios de emergencia de cerrajería, gasfitería, electricidad o vidriería atendidos por  técnicos especializados disponible  las 24 horas del día, todo el año, hasta un máximo de 4 eventos al año por cada servicio y hasta S/300 por evento."]
[]
["Servicio de orientación telefónica para referencia y coordinación del servicio de fumigaciones y mantenimiento en general, sin limite"]
[]
["ASISTENCIA LEGAL Y TRIBUTARIA PARA EL NEGOCIO",null,null,null,null,null,null,null,null,null,null,null,null,null,"OK"]
[]
["Asistencia Legal en caso de Robo del Negocio, disponible las 24 horas del día y  hasta 2 eventos al año."]
["Asistencia Tributaria Vía Telefónica, disponible las 24 horas del día ,  sin limite."]
["Asesoría telefónica en cuanto a materia Tributaria, Legal, Penal y Familiar, sin limite."]
["Asesoría telefónica en temas referentes a Permisos, Trámites y Licencias, disponible las 24 horas del día, sin límite."]
[]
["CONDICIONES APLICABLES A TODAS LAS SECCIONES",null,null,null,null,null,null,null,null,null,null,null,null,null,"OK"]
[]
["Monto Indemnizable: Para efectos de este seguro se entenderá como el monto total de la pérdida amparada por la póliza antes de aplicar el deducible."]
[]
["La Suma Asegurada de cada una de las Secciones adicionales a INCENDIO forman parte integrante de la Suma Asegurada de Incendio, se comportan como sub límite a Primera Perdida."]
[]
[]
["GARANTIAS APLICABLES A TODA LA PÓLIZA"]
[]
["En caso de incumplimiento EL CONTRATANTE y/o ASEGURADO perderán Todo derecho indemnizatorio proveniente de esta Póliza, a partir del momento mismo de la violación quedando En consecuencia liberada LA COMPAÑÍA de toda responsabilidad."]
[]
[]
["CONDICIONES ESPECIALES A TODA LA PÓLIZA",null,null,null,null,null,null,null,null,null,null,null,null,null,"OK"]
["Se deja constancia expresa que, a potestad de la Compañía, la aceptación final del riesgo por parte de ésta queda sujeta a la realización de la inspección o evaluación, por parte de nuestro Departamento de Ingeniería o la persona autorizada para tal efecto, para verificar el efectivo estado del riesgo, así como el estricto cumplimiento por parte del Asegurado de las garantías que a mérito de dicha inspección establezca el Departamento de Ingeniería de la Compañía."]
[]
[]
[]
[]
[]
["CONDICIONES APLICABLES A LA COTIZACIÓN",null,null,null,null,null,null,null,null,null,null,null,null,null,"OK"]
["Se deja constancia expresa que la presente cotización se originó con información brindada por el ASEGURADO y/o CONTRATANTE, así como la no existencia de siniestros conocidos, ocurridos, ni reportados."]
[]
["Las condiciones antes detalladas quedan sujetas al no aumento de la siniestralidad antes del inicio de la vigencia."]
["La presente cotización se ha basado en la información presentada por el cliente, en caso de sufrir modificaciones para la orden de emisión, Pacifico se reserva el derecho de anular, cambiar o ajustar las condiciones y términos presentados."]
[]
["La presente cotización tiene una validez de quince (15) días calendarios, contados a partir de la fecha de presentación por parte de Pacífico."]
[]
["La presente cotización tiene una validez de 15 días"]
["La Compañía, se obliga a entregar la póliza de seguro al contratante y/o asegurado dentro de 15 días calendario de haber recibido la solicitud si no media rechazo previo de ésta. En el supuesto que el contratante y/o asegurado no completen la información y/o no cumplan con las medidas que la compañía requiera, se considerará rechazada la solicitud al vencimiento del plazo indicado. El contratante y/o asegurado podrá presentar una nueva solicitud."]
[]
[]
[]
[]
[]
["PROTECCIÓN PARA NEGOCIO",null,null,null,null,null,null,null,null,null,null,null,null,null,"OK"]
["La COMPAÑÍA informará al Contratante, dentro de los quince (15) días de recibida esta Solicitud, si la misma ha sido rechazada, salvo que se le haya requerido información adicional, necesaria para la evaluación del riesgo, en el referido plazo. En este caso, el plazo para comunicar el rechazo, se contará a partir de la recepción de la información completa solicitada."]
[]
[]
[]
[]
[]
["PRIMA COMERCIAL:",null,{"$f":"PagodePrimasLocal1!$AH$10","v":0},"USD"]
[]
["PRIMA COMERCIAL + IGV:",null,{"$f":"IF(AND(PagodePrimasLocal1!$AD$21=1,Cotizador!$I$87=\"\"),PagodePrimasLocal1!$AG$10,IF(Cotizador!$I$87=\"\",\"----\",PagodePrimasLocal1!$AG$12))","v":"----"},"USD"]
[]
[]
[]
["Cordialmente,"]
[]
[{"$f":"+TODAY()","v":"2023-03-21"}]

{"sheet":"ACCO","index":18,"n_rows":88,"n_cols":15,"rows_kept":88,"cut":false,"hidden":false,"merged":[[69,2,69,8],[71,2,71,3],[71,6,71,7],[82,0,82,12],[62,2,62,5],[60,2,60,5],[61,2,61,5],[41,2,41,3],[42,3,42,4],[43,3,43,4],[47,2,47,8],[46,0,46,12],[53,2,53,8],[55,2,55,8],[56,2,56,8],[58,2,58,8],[59,2,59,5],[33,0,33,12],[39,2,39,3],[40,2,40,3],[28,4,28,8],[31,4,31,8],[87,0,87,1],[83,0,83,12],[3,0,3,12],[48,2,48,12],[49,2,49,12],[50,2,50,12],[51,2,51,12],[52,2,52,12],[4,3,4,9],[20,4,20,8],[21,4,21,8],[6,0,6,12],[25,4,25,8],[22,4,22,8],[35,3,35,4],[38,2,38,3]]}
[]
[]
[]
["ACCIDENTES COLECTIVOS",null,null,null,null,null,null,null,null,null,null,null,null,null,"OK"]
[]
[]
["DATOS GENERALES"]
[]
[null,null,null,"Fecha de la cotización:",{"$f":"TODAY()","v":"2023-03-21"}]
[]
[null,null,null,"Producto:","ACCO"]
[null,null,null,"Plan:","Colectivo"]
[null,null,null,"Moneda:","Dólares"]
[]
[null,null,null,"Vigencia de la Póliza:","12 meses"]
[]
[null,null,null,null,"Local 1","Local 2","Local 3"]
[null,null,null,"Número de asegurados: "]
[null,null,null," (max 20 por Local)"]
[]
[null,null,null,"RUC Contratante",{"$f":"IF(LEN(Solicitud.Manual!$E$8)=0,\"\",Solicitud.Manual!$E$8)","v":""}]
[null,null,null,"Nombre Contratante",{"$f":"IF(LEN(Solicitud.Manual!$C$9)=0,\"\",Solicitud.Manual!$C$9)","v":""}]
[null,null,null,"Broker:",{"$f":"IF(LEN(Solicitud.Manual!$D$148)=0,\"\",Solicitud.Manual!$D$148)","v":""}]
[]
[null,null,null,null,"Local 1"]
[null,null,null,"Actividad:",{"$f":"IF(LEN(E18)>0,IF(LEN(Cotizador!$D$54)=0,\"\",Cotizador!$D$54),\"\")","v":""}]
[]
[null,null,null,null,"Local 2"]
[null,null,null,"Actividad:",{"$f":"IF(LEN(F18)>0,IF(LEN(Cotizador!$D$56)=0,\"\",Cotizador!$D$56),\"\")","v":""}]
[]
[null,null,null,null,"Local 3"]
[null,null,null,"Actividad:",{"$f":"IF(LEN(G18)>0,IF(LEN(Cotizador!$D$58)=0,\"\",Cotizador!$D$58),\"\")","v":""}]
[]
["COBERTURAS (*)",null,null,null,null,null,null,null,null,null,null,null,null,null,"OK"]
[]
[null,null,null,"Moneda:",null,{"$f":"E13","v":"Dólares"}]
[]
[null,null,null,null,"Local 1","Local 2","Local 3"]
[null,null,"Muerte Accidental:","Muerte Accidental:"]
[null,null,"Invalidez Permanente:","Invalidez Permanente:",{"$f":"IF(E39=5000,5000,IF(E39=10000,10000,IF(E39=15000,15000,0)))","v":0},{"$f":"IF(F39=5000,5000,IF(F39=10000,10000,IF(F39=15000,15000,0)))","v":0},{"$f":"IF(G39=5000,5000,IF(G39=10000,10000,IF(G39=15000,15000,0)))","v":0}]
[null,null,"Gastos de Curación:","Gastos de Curación:"]
[null,null,"Gastos de Sepelio:","Gastos de Sepelio:"]
[null,null,null,"Transporte por Evacuación:","Transporte por Evacuación:"]
[null,null,null,"Traslado de Restos:","Traslado de Restos:"]
[]
[]
["CLÁUSULAS ADICIONALES",null,null,null,null,null,null,null,null,null,null,null,null,null,"OK"]
[null,null,"Cláusula de invalidez permanente parcial previa al seguro."]
[null,null,"Cláusula por la cobertura de Terrorismo y otros riesgos. "]
[null,null,"Cláusula por la práctica no profesional de deportes y/o actividades de riesgo."]
[null,null,"Cláusula por la conducción urbana o rural de motocicletas, motonetas y otros vehículos similares."]
[null,null,"Cláusula para pasajeros que usan cualquier medio habitual de transporte público de personas, en vehículos que no recorren itinerarios regulares y fijos. "]
[null,null,"Cláusula para pasajeros de aviones y/o helicópteros particulares y/o de la FAP por viajes eventuales. "]
[null,null,"Cláusula de ampliación del límite máximo de edad, personas mayores de 70 y hasta los 80 años inclusive."]
[]
[null,null,"RECARGOS"]
[null,null,"Por usar y/o portar armas"]
[]
[null,null,"DESCUENTOS"]
[null,null,"Por limitación a horas de trabajo."]
[null,null,"Por cubrir gastos no reembolsables por ESSALUD."]
[null,null,"Por aplicación de franquicia en incapacidad temporal.",null,null,null,"30 días"]
[null,null,"Por aplicación de deducible en gastos de curación.",null,null,null,0.25]
[null,null,null,null,"Local 1","Local 2","Local 3",null,"Total"]
[null,null,null,"Prima Neta Total.",{"$f":"E67*E18","v":0},{"$f":"F67*F18","v":0},{"$f":"G67*G18","v":0},null,{"$f":"SUM(E65:G65)","v":0}]
[null,null,null,"Prima Total (incluye IGV y DE):",{"$f":"E65*1.2154","v":0},{"$f":"F65*1.2154","v":0},{"$f":"G65*1.2154","v":0},null,{"$f":"SUM(E66:G66)","v":0}]
[null,null,null,"Prima neta por Persona:",{"$f":"IF(E39=5000,5,IF(E39=10000,7.5,IF(E39=15000,10,0)))","v":0},{"$f":"IF(F39=5000,5,IF(F39=10000,7.5,IF(F39=15000,10,0)))","v":0},{"$f":"IF(G39=5000,5,IF(G39=10000,7.5,IF(G39=15000,10,0)))","v":0},null,{"$f":"SUM(E67:G67)","v":0}]
[null,null,null,"Prima Total por Persona",{"$f":"E67*1.2154","v":0},{"$f":"F67*1.2154","v":0},{"$f":"G67*1.2154","v":0},null,{"$f":"SUM(E68:G68)","v":0}]
[]
[null,null,"TABLA DE PRIMAS"]
[]
[null,null,"Dias de Seguro",null,"Prima Neta",null,"Meses de Seguro",null,"Prima Neta"]
[null,null,1,0.05,{"$f":"D73*E67","v":0},null,2,0.3,{"$f":"H73*E67","v":0}]
[null,null,2,7.0000000000000007E-2,{"$f":"D74*E67","v":0},null,3,0.4,{"$f":"H74*E67","v":0}]
[null,null,3,0.09,{"$f":"D75*E67","v":0},null,4,0.5,{"$f":"H75*E67","v":0}]
[null,null,4,0.11,{"$f":"D76*E67","v":0},null,5,0.6,{"$f":"H76*E67","v":0}]
[null,null,5,0.13,{"$f":"D77*E67","v":0},null,6,0.7,{"$f":"H77*E67","v":0}]
[null,null,6,0.14000000000000001,{"$f":"D78*E67","v":0},null,7,0.8,{"$f":"H78*E67","v":0}]
[null,null,7,0.15,{"$f":"D79*E67","v":0},null,8,0.9,{"$f":"H79*E67","v":0}]
[null,null,"8 a 15",0.2,{"$f":"D80*E67","v":0},null,"más de 9",1,{"$f":"H80*E67","v":0}]
[null,null,"16 a 30",0.25,{"$f":"D81*E67","v":0}]
[]
["COMENTARIOS",null,null,null,null,null,null,null,null,null,null,null,null,null,"OK"]
["Ingresa aquí tu comentario"]
[]
["Cordialmente,"]
[]
[{"$f":"+TODAY()","v":"2023-03-21"}]

{"sheet":"CuestionarioTransporte","index":19,"n_rows":65,"n_cols":34,"rows_kept":65,"cut":false,"hidden":false,"merged":[[25,1,25,2],[1,1,1,3],[15,1,15,2],[16,1,16,2],[17,1,17,2],[21,1,21,2],[14,1,14,2],[18,1,18,2],[22,1,22,2],[23,1,23,2],[19,1,19,2],[20,1,20,2],[27,1,27,13],[28,1,28,13],[30,1,30,13],[31,1,31,13],[32,1,32,13],[33,1,33,13],[34,1,34,13],[35,1,35,13],[36,1,36,13],[37,1,37,13],[38,1,38,13],[39,1,39,13],[40,1,40,13],[41,1,41,13],[42,1,42,13],[43,1,43,13],[44,1,44,13],[45,1,45,13],[46,1,46,13],[47,1,47,13]]}
[]
[null,"CUESTIONARIO DEL SEGURO DE TRANSPORTE NACIONAL"]
[]
[null,"DATOS DEL CONTRATANTE"]
[null,"NOMBRE O RAZÓN SOCIAL",{"$f":"IF(LEN(#REF!)=0,\"\",#REF!)","v":{"$error":"#REF!"}}]
[null,"RUC",{"$f":"IF(LEN(#REF!)=0,\"\",#REF!)","v":{"$error":"#REF!"}}]
[]
[null,"DATOS DEL ASEGURADO"]
[null,"NOMBRE O RAZÓN SOCIAL",{"$f":"IF(LEN(#REF!)=0,\"\",#REF!)","v":{"$error":"#REF!"}}]
[null,"RUC",{"$f":"IF(LEN(#REF!)=0,\"\",#REF!)","v":{"$error":"#REF!"}}]
[]
[null,"CONTRATACIÓN DE SEGURO"]
[null,"TIPO DE CONTRATACIÓN"]
[]
[null,"PREGUNTAS",null,"RESPUESTA"]
[null,"Experiencia siniestralidad previa"]
[null,"¿El contratante es dueño de la mercadería?"]
[null,"Tipo de mercadería a transportar (Detallar)"]
[null,"Tipo de embalaje"]
[null,"Radio de Acción",null,null,null,null,null,null,null,null,null,null,null,null,null,null,null,null,null,null,null,null,null,null,null,null,null,null,null,"Transportes"]
[null,"Medio de transporte a utilizar",null,null,null,null,null,null,null,null,null,null,null,null,null,null,null,null,null,null,null,null,null,null,null,null,null,null,null,2,null,1436,{"$f":"IFERROR(AF21/(1+$AE$14),0)","v":1436},{"$f":"+IF($AD$21=2,4,\"\")","v":4}]
[null,"Medidas de seguridad utilizadas durante el transporte.",null,null,null,null,null,null,null,null,null,null,null,null,null,null,null,null,null,null,null,null,null,null,null,null,null,null,null,null,null,{"$f":"IFERROR(IF(OR($E$60=4,$E$60=12),$AF$21*VLOOKUP($E$60,PagodePrimasLocal1!$AD$35:$AF$40,3,0),$AF$21*SUMPRODUCT((PagodePrimasLocal1!$AD$35:$AD$40=$E$60)*(PagodePrimasLocal1!$AE$35:$AE$40=$C$55)*(PagodePrimasLocal1!$AF$35:$AF$40))),0)","v":154.50111812874167},null,{"$f":"+IF($AD$21=2,6,\"\")","v":6}]
[null,"Límite Máximo por Embarque (en USD)",null,25000,null,null,null,null,null,null,null,null,null,null,null,null,null,null,null,null,null,null,null,null,null,null,null,null,null,null,null,{"$f":"SUM(AF21:AF22)","v":1590.5011181287416},null,{"$f":"+IF($AD$21=2,10,\"\")","v":10}]
[null,{"$f":"tablaTransportes!$G$2","v":"Movimiento Anual (en USD) Mínimo USD 150,000"},null,null,null,null,null,null,null,null,null,null,null,null,null,null,null,null,null,null,null,null,null,null,null,null,null,null,null,null,null,null,null,{"$f":"+IF($AD$21=2,12,\"\")","v":12}]
[]
[null,"Prima Comercial + IGV",null,345]
[]
[null,"DESCRIPCION DE LA MERCANCIA:"]
[null,"Mercadería de terceros bajo su responsabilidad, custodia o control, excluyendo: "]
[]
[null,"1. Animales vivos"]
[null,"2. Explosivos y productos químicos de naturaleza explosiva o autocombustible y productos fiscalizados."]
[null,"3. Fosforo (cerillas), fulminantes comunes y eléctricos"]
[null,"4. Armas y Municiones"]
[null,"5. Joyas, documentos valorados, valores, obras de arte, pieles, dinero o cualquier papel que lo represente, piedras preciosas y relojes,"]
[null,"6. Menaje de casa y/o equipaje acompañado y/o efectos personales."]
[null,"7. Equipos de cómputo, sus partes y piezas, software no instalado."]
[null,"8. Tarjetas telefónicas, tablets, similares y sus partes y piezas"]
[null,"9. Equipos de telefonía móvil (celulares, smartphones, iphones, modems)"]
[null,"10. CDs, DVDs, Blurays, videojuegos y televisores."]
[null,"11. Todo tipo de productos a granel (granos secos o líquidos)."]
[null,"12. Concentrado de minerales tales como: oro y plata, "]
[null,"13. Cátodos de Cobre, Cableado eléctrico"]
[null,"14. Llantas con neumáticos / sin neumáticos,"]
[null,"15. Productos farmacéuticos"]
[null,"16. Licores, Cigarrillos "]
[null,"17. Artículos para deportes "]
[null,"18. Café en sacos y tipo exportación"]
[]
[]
["Pago de Primas"]
[]
[null,"Autorizaciones"]
[]
[null,"Condición de pago","Cupones","Emitir Factura?","SÍ"]
[]
[]
[null,"Inicio de Vigencia y Pago"]
[]
[null,"Forma de pago",null,"Nro. Cuotas:",10]
[null,null,"Al Contado","Inicio Vigencia Póliza:",{"$f":"TODAY()","v":"2023-03-21"}]
[null,null,"En cuotas"]
[]
[null,null,null,"Monto Total a Pagar Anual (incluye IGV y DE):",{"$f":"IF(AND($AD$21=1,$E$60=\"\"),$AF$21,IF($E$60=\"\",\"----\",$AF$23))","v":1590.5011181287416}]
[null,null,null,"Monto Total a Pagar Mensual:",{"$f":"IF(ISERROR(IF(E60=\" \",\"---\",E64/E60)),0,IF(E60=\" \",\"---\",E64/E60))","v":159.05011181287415}]

{"sheet":"TransportistaTerrestre","index":20,"n_rows":117,"n_cols":15,"rows_kept":117,"cut":false,"hidden":false,"merged":[[31,0,31,12],[32,0,32,12],[33,0,33,12],[34,0,34,12],[18,0,18,12],[20,0,20,12],[21,0,21,12],[23,0,23,12],[24,0,24,12],[25,0,25,12],[26,0,26,12],[27,0,27,12],[28,0,28,12],[29,0,29,12],[30,0,30,12],[71,0,71,12],[73,0,73,12],[75,0,75,12],[97,0,97,12],[98,0,98,12],[83,0,83,12],[84,0,84,12],[85,0,85,12],[86,0,86,12],[87,0,87,12],[88,0,88,12],[77,0,77,12],[79,0,79,12],[81,0,81,12],[82,0,82,12],[35,0,35,12],[36,0,36,12],[37,0,37,12],[38,0,38,12],[39,0,39,12],[50,2,50,12],[40,0,40,12],[43,0,43,12],[45,0,45,12],[48,0,48,12],[1,0,1,12],[14,0,14,12],[15,0,15,12],[17,0,17,12],[7,3,7,12],[9,3,9,12],[11,3,11,12],[2,0,2,12],[3,0,3,12],[65,0,65,12],[63,0,63,12],[67,0,67,12],[69,0,69,12],[51,2,51,12],[57,2,57,12],[58,2,58,12],[59,2,59,12],[60,2,60,12],[52,2,52,12],[53,2,53,12],[54,2,54,12],[55,2,55,12],[56,2,56,12],[116,0,116,1],[90,0,90,12],[92,0,92,12],[94,0,94,12],[95,0,95,12],[96,0,96,12],[99,0,99,12],[101,0,101,12],[102,0,102,12]]}
[]
["SLIP DE COTIZACIÓN PARA EL SEGURO DE CARGA",null,null,null,null,null,null,null,null,null,null,null,null,null,"OK"]
["TRANSPORTE NACIONAL"]
["(TRANSPORTISTAS TERRESTRE)"]
[]
[]
[]
[null,"CONTRATANTE: ",null,{"$f":"IF(LEN(CuestionarioTransporte!$C$5)>0,CuestionarioTransporte!$C$5,\"\")","v":{"$error":"#REF!"}}]
[]
[null,"RUC: ",null,{"$f":"IF(LEN(CuestionarioTransporte!$C$6)>0,CuestionarioTransporte!$C$6,\"\")","v":{"$error":"#REF!"}}]
[]
[null,"ASEGURADO",null,{"$f":"IF(LEN(CuestionarioTransporte!$C$9)>0,CuestionarioTransporte!$C$9,\"\")","v":{"$error":"#REF!"}}]
[null,"Propietario de la mercadería"]
[]
["RADIO DE ACCION "]
["Dentro del Territorio Nacional; excluyendo el tránsito previo de la exportación y el transito posterior de importación, así como el transporte fluvial."]
[]
["MEDIOS DE TRANSPORTE "]
["En vehículos de carga de propiedad del Asegurado y/o de terceros que cuenten con autorización vigente otorgada por las Autoridades competentes para prestar el servicio de transporte terrestre automotor de carga y que se encuentren inscritos en los registros de la Dirección de Transporte Terrestre del Ministerio de Transporte y Comunicaciones. "]
[]
["DESCRIPCION DE LA MERCANCIA:",null,null,null,null,null,null,null,null,null,null,null,null,null,"OK"]
["Mercadería de terceros bajo su responsabilidad, custodia o control, excluyendo: "]
[]
["1. Animales vivos"]
["2. Explosivos y productos químicos de naturaleza explosiva o autocombustible y productos fiscalizados."]
["3. Fosforo (cerillas), fulminantes comunes y eléctricos"]
["4. Armas y Municiones"]
["5. Joyas, documentos valorados, valores, obras de arte, pieles, dinero o cualquier papel que lo represente, piedras preciosas y relojes,"]
["6. Menaje de casa y/o equipaje acompañado y/o efectos personales."]
["7. Equipos de cómputo, sus partes y piezas, software no instalado."]
["8. Tarjetas telefónicas, tablets, similares y sus partes y piezas"]
["9. Equipos de telefonía móvil (celulares, smartphones, iphones, modems)"]
["10. CDs, DVDs, Blurays, videojuegos y televisores."]
["11. Todo tipo de productos a granel (granos secos o líquidos)."]
["12. Concentrado de minerales tales como: oro y plata, "]
["13. Cátodos de Cobre, Cableado eléctrico"]
["14. Llantas con neumáticos / sin neumáticos,"]
["15. Productos farmacéuticos"]
["16. Licores, Cigarrillos "]
["17. Artículos para deportes "]
["18. Café en sacos y tipo exportación"]
[]
[]
["VALORIZACION DE LA MERCANCIA ",null,null,null,null,null,null,null,null,null,null,null,null,null,"OK"]
[]
["Factura Comercial y/o Guía de Remisión excluyendo los Impuestos de Ley"]
[]
[]
["COBERTURAS ",null,null,null,null,null,null,null,null,null,null,null,null,null,"OK"]
[]
[null,"CODIGO","CLAUSULAS"]
[null,107430,"990000 - CLAUSULAS GENERALES CONTRATACIÓN RIESGOS GENERALES"]
[null,107491,"111000 TRANSPORTES CARGA ABIERTA - CONDICIONES GENERALES"]
[null,107209,"CL TRA002 ACCIDENTE AL MEDIO DE TRANSPORTE  "]
[null,107212,"CL TRA012  DE ROBO POR ASALTO"]
[null,107215,"CL TRA013 DE TRANSITO"]
[null,107226,"066 CLAUSULA DE LOCALIDAD DEL INSTITUTO"]
[null,107228,"CL DE TERMINACION DEL TRANSITO (TERRORISMO) "]
[null,107217,"256 CL DEL INST PARA HUELGAS (CARGAMENTOS) "]
[null,107202,"356 CL DEL INST SOBRE EXCLUSION DE CONTAMINACION RADIOACTIVA"]
[null,107214,"CL TRA003  DE CARGA Y DESCARGA"]
[]
[]
["LIMITE MAXIMO DE RESPONSABILIDAD ",null,null,null,null,null,null,null,null,null,null,null,null,null,"OK"]
[]
["HASTA US$50,000.00 Cincuenta mil  dólares americanos "]
[]
["Cualquier exceso en el límite indicado deberá ser puesto en conocimiento de la compañía de seguros para su aprobación antes del inicio del viaje. "]
[]
["Límite agregado anual por Robo: $50,000.00"]
[]
["MOVIMIENTO ESTIMADO ANUAL (MAE)",null,null,null,null,null,null,null,null,null,null,null,null,null,"OK"]
[]
["US$ 500,000.00 Quinientos mil dólares americanos (MINIMO) máximo $5,000,000.00"]
[]
["El Asegurado se compromete en proporcionar a la Compañía después de haber terminado la vigencia de esta Póliza, la suma total definitiva del período de seguro, en base a los libros contables. "]
[]
["CONDICIONES ESPECIALES",null,null,null,null,null,null,null,null,null,null,null,null,null,"OK"]
[]
["Queda entendido y convenido que las operaciones de transporte terrestre de mercadería deben realizarse considerando lo siguiente:"]
[]
["·         Que los transportes realizados por vehículos de terceros deben ser realizados bajo manifiestos / carta de porte (o nombre aplicable al documento) y/o guía de remisión emitida por el Asegurado y/o por el propietario de la mercadería."]
["·         Que los Conductores de los vehículos propios y de terceros son personas debidamente habilitadas y premunidas de una Licencia de conducir vigente y que corresponda a la clase y categoría prevista en el Reglamento de Licencias de Conducir para las características del vehículo que conduce. Los conductores deberán encontrarse identificados en el Registro de Nómina de Conductores del Registro Nacional de Transporte Terrestre del MTC."]
["·         Que los vehículos propios y de terceros a utilizar deberán ser cerrados, evitando que la mercadería se encuentre expuesta a simple vista, salvo aquella carga que por su propia naturaleza y/o dimensiones no pueda ser transportada en vehículos cerrados. "]
["·         Que los vehículos de carga propios y de terceros no deben ser estacionados en sitios o lugares en los cuales no exista iluminación. En caso se tenga que pernoctar por motivos debidamente justificados, la unidad deberá permanecer en un estacionamiento que sea autorizado por el Asegurado, que se encuentre dentro de la ruta establecida para el transporte y que garantice la seguridad de la mercadería a través de medidas de protección y vigilancia policial o privada. "]
["·         Que todos los transportes terrestres deben ser realizados en vehículos propios y de terceros que cuenten con un sistema de posicionamiento global (GPS) que brinde información en tiempo real y que se encuentre en funcionamiento mientras la mercadería se encuentre en el vehículo. Este sistema deberá brindar señales de alarma a un Centro de Control Terrestre en forma automática y a través de un dispositivo o botón de pánico; asimismo, deben contar con cobertura total dentro de las rutas establecidas para el transporte. El seguimiento de la situación de los vehículos durante el servicio debe ser continuo y permanente las 24 horas del día y se debe contar con un plan de contingencias y sistema de respuesta rápida ante ocurrencias, asaltos y/o situaciones de emergencia."]
["·         Que los Conductores deben utilizar medios alternos de comunicación, tales como equipos de radio y/o teléfonos celulares y mantener comunicación permanente con los centros de control durante el traslado de la mercancía."]
["·         Que las unidades transportadoras no deben llevar publicidad o propaganda que indique que están transportando."]
["·         Que los Conductores de vehículos propios y de terceros no deberán realizar jornadas de conducción continúas de más de cinco (05) horas para el servicio diurno o más de cuatro (04) horas en el servicio nocturno. Tras alcanzar el periodo máximo de conducción continua, el Conductor hará una pausa ininterrumpida de por lo menos 45 minutos. La duración acumulada de jornadas de conducción no deberá exceder de diez (10) horas en un periodo de veinte y cuatro (24) horas, contadas desde la hora de inicio de la conducción en un servicio."]
[]
["La inobservancia de estas Condiciones Especiales liberará de toda responsabilidad indemnizatoria a la Compañía de Seguros. "]
[]
["EXCLUSIONES",null,null,null,null,null,null,null,null,null,null,null,null,null,"OK"]
[]
["a)    Actos de deshonestidad cometidos por los empleados del Asegurado cuando la mercancía sea transportada en vehículos de propiedad del Asegurado y/o de terceros bajo su responsabilidad. "]
["b)    Olvido y/o negligencia y/o embriaguez de los empleados y/o personas encargadas del transporte y custodia de acuerdo a la Ley, cuando la mercancía sea transportada en vehículos de propiedad el Asegurado y/o de terceros bajo su responsabilidad. "]
["c)    Robo por escape, ratería, hurto, estafa, engaño, sustracciones sistemáticas, fraude o desaparición, cuando la mercancía sea transportada en vehículos de propiedad del Asegurado y/o de terceros bajo su responsabilidad. "]
["d)    Robo por desaparición mientras los objetos asegurados o el medio transportador se encuentre dentro de algún local o recinto del Asegurado o de terceros, en calidad de depositarios y no como parte del tránsito ordinario. "]
["e)    Pérdidas y/o daños causados a la mercancía asegurada como consecuencia de choques contra puentes y/o túneles durante su traslado terrestre, hasta su destino final."]
["f)     El contratante de la póliza podrá contratar a todos los transportistas que cumplan con las condiciones de la póliza; los Transportistas contratados no podrán subcontratar a otros transportistas"]
[]
["REAJUSTE DE PRIMAS ",null,null,null,null,null,null,null,null,null,null,null,null,null,"OK"]
["La Compañía se reserva el derecho de efectuar revisiones de la Póliza y reajustar las Tasas y deducibles de acuerdo al índice de siniestralidad que presente la Póliza, previo acuerdo con el Asegurado y/o Broker de seguros. "]
[]
[null,"DEDUCIBLES"]
[null,"Para robo por asalto:",null,"20% del monto indemnizable, mínimo US$ 500 por evento"]
[null,"Para otros riesgos: ",null,"10% del monto indemnizable, mínimo US$ 200 por evento"]
[]
[]
[null,"ESQUEMA DE PRIMAS NETAS"]
[]
[null,"·         Prima neta anual USD:",null,null,{"$f":"CuestionarioTransporte!$D$26","v":345}]
[]
[]
["Cordialmente,"]
[]
[{"$f":"+TODAY()","v":"2023-03-21"}]

{"sheet":"PropietarioMercaderia","index":21,"n_rows":117,"n_cols":15,"rows_kept":117,"cut":false,"hidden":false,"merged":[[116,0,116,1],[7,3,7,12],[9,3,9,12],[11,3,11,12],[17,0,17,12],[19,0,19,12],[20,0,20,12],[22,0,22,12],[23,0,23,12],[25,0,25,12],[26,0,26,12],[28,0,28,12],[29,0,29,12],[30,0,30,12],[31,0,31,12],[32,0,32,12],[1,0,1,12],[2,0,2,12],[3,0,3,12],[14,0,14,12],[15,0,15,12],[34,0,34,12],[37,0,37,12],[38,0,38,12],[41,0,41,12],[42,0,42,12],[46,2,46,12],[47,2,47,12],[48,2,48,12],[49,2,49,12],[50,2,50,12],[51,2,51,12],[52,2,52,12],[53,2,53,12],[54,2,54,12],[55,2,55,12],[56,2,56,12],[57,2,57,12],[58,2,58,12],[61,0,61,12],[63,0,63,12],[65,0,65,12],[67,0,67,12],[69,0,69,12],[71,0,71,12],[73,0,73,12],[76,0,76,12],[78,0,78,12],[80,0,80,12],[81,0,81,12],[82,0,82,12],[83,0,83,12],[84,0,84,12],[85,0,85,12],[86,0,86,12],[88,0,88,12],[91,0,91,12],[93,0,93,12],[94,0,94,12],[95,0,95,12],[104,0,104,12],[96,0,96,12],[97,0,97,12],[98,0,98,12],[100,0,100,12],[101,0,101,12]]}
[]
["SLIP DE COTIZACIÓN PARA EL SEGURO DE CARGA",null,null,null,null,null,null,null,null,null,null,null,null,null,"OK"]
["TRANSPORTE NACIONAL"]
["(PROPIETARIO DE MERCADERÍA)"]
[]
[]
[]
[null,"CONTRATANTE: ",null,{"$f":"IF(LEN(CuestionarioTransporte!$C$5)>0,CuestionarioTransporte!$C$5,\"\")","v":{"$error":"#REF!"}}]
[]
[null,"RUC: ",null,{"$f":"IF(LEN(CuestionarioTransporte!$C$6)>0,CuestionarioTransporte!$C$6,\"\")","v":{"$error":"#REF!"}}]
[]
[null,"ASEGURADO",null,{"$f":"IF(LEN(CuestionarioTransporte!$C$9)>0,CuestionarioTransporte!$C$9,\"\")","v":{"$error":"#REF!"}}]
[]
[]
["RADIO DE ACCION "]
["Dentro del Territorio Nacional; excluyendo el tránsito previo de la exportación y el transito posterior de importación."]
[]
["MEDIOS DE TRANSPORTE "]
[]
["Terrestre"]
["En vehículos de carga de propiedad del Asegurado y/o de terceros que cuenten con autorización vigente otorgada por las Autoridades competentes para prestar el servicio de transporte terrestre automotor de carga y que se encuentren inscritos en los registros de la Dirección de Transporte Terrestre del Ministerio de Transporte y Comunicaciones. "]
[]
[]
[]
[]
[]
[]
[]
[]
[]
[]
[]
[]
[]
["La inobservancia de lo antes mencionado, liberará de responsabilidad a la Compañía. "]
[]
[]
["DESCRIPCION DE LA MERCANCIA:",null,null,null,null,null,null,null,null,null,null,null,null,null,"OK"]
["Mercadería de PROPIO DEL GIRO DEL NEGOCIO DEL ASEGURADO"]
[{"$f":"IF(LEN(CuestionarioTransporte!$D$18)>0,CuestionarioTransporte!$D$18,\"\")","v":""}]
[]
["VALORIZACION DE LA MERCANCIA ",null,null,null,null,null,null,null,null,null,null,null,null,null,"OK"]
["Factura Comercial y/o Guía de Remisión excluyendo los Impuestos de Ley más flete."]
[]
[null,"COBERTURAS "]
[]
[null,"CODIGO","CLAUSULAS"]
[null,107430,"990000 - CLAUSULAS GENERALES CONTRATACIÓN RIESGOS GENERALES"]
[null,107491,"111000 TRANSPORTES CARGA ABIERTA - CONDICIONES GENERALES"]
[null,107209,"CL TRA002 ACCIDENTE AL MEDIO DE TRANSPORTE  "]
[null,107212,"CL TRA012  DE ROBO POR ASALTO"]
[null,107215,"CL TRA013 DE TRANSITO"]
[null,107226,"066 CLAUSULA DE LOCALIDAD DEL INSTITUTO"]
[null,107228,"CL DE TERMINACION DEL TRANSITO (TERRORISMO) "]
[null,107217,"256 CL DEL INST PARA HUELGAS (CARGAMENTOS) "]
[null,107202,"356 CL DEL INST SOBRE EXCLUSION DE CONTAMINACION RADIOACTIVA"]
[null,107214,"CL TRA003  DE CARGA Y DESCARGA"]
[null,107213,"CL TRA011 DE ROBO CON FRACTURA"]
[null,105326,"CLAUSULA DE RIESGOS DE LA NATURALEZA"]
[]
[]
["LIMITE MAXIMO DE RESPONSABILIDAD ",null,null,null,null,null,null,null,null,null,null,null,null,null,"OK"]
[]
["HASTA US$25,000.00 Cincuenta mil  dólares americanos "]
[]
["Cualquier exceso en el límite indicado deberá ser puesto en conocimiento de la compañía de seguros para su aprobación antes del inicio del viaje. "]
[]
["Límite agregado anual por Robo: $25,000.00"]
[]
["MOVIMIENTO  ANUAL (MA)",null,null,null,null,null,null,null,null,null,null,null,null,null,"OK"]
[]
["Desde  US$ 150,000.00  dólares americanos hasta  $2,000,000.00"]
[]
["El Asegurado se compromete en proporcionar a la Compañía después de haber terminado la vigencia de esta Póliza, la suma total definitiva del período de seguro, en base a los libros contables. "]
[]
[]
["CONDICIONES ESPECIALES",null,null,null,null,null,null,null,null,null,null,null,null,null,"OK"]
[]
["Queda entendido y convenido que las operaciones de transporte terrestre de mercadería deben realizarse considerando lo siguiente:"]
[]
["·         Que los transportes realizados por vehículos de terceros deben ser realizados bajo manifiestos / carta de porte (o nombre aplicable al documento) y/o guía de remisión emitida por el Asegurado y/o por el propietario de la mercadería."]
["·         Que los Conductores de los vehículos propios y de terceros son personas debidamente habilitadas y premunidas de una Licencia de conducir vigente y que corresponda a la clase y categoría prevista en el Reglamento de Licencias de Conducir para las características del vehículo que conduce. Los conductores deberán encontrarse identificados en el Registro de Nómina de Conductores del Registro Nacional de Transporte Terrestre del MTC."]
["·         Que los vehículos propios y de terceros a utilizar deberán ser cerrados, evitando que la mercadería se encuentre expuesta a simple vista, salvo aquella carga que por su propia naturaleza y/o dimensiones no pueda ser transportada en vehículos cerrados. "]
["·         Que los vehículos de carga propios y de terceros no deben ser estacionados en sitios o lugares en los cuales no exista iluminación. En caso se tenga que pernoctar por motivos debidamente justificados, la unidad deberá permanecer en un estacionamiento que sea autorizado por el Asegurado, que se encuentre dentro de la ruta establecida para el transporte y que garantice la seguridad de la mercadería a través de medidas de protección y vigilancia policial o privada. "]
["·         Que todos los transportes terrestres deben ser realizados en vehículos propios y de terceros que cuenten con un sistema de posicionamiento global (GPS) que brinde información en tiempo real y que se encuentre en funcionamiento mientras la mercadería se encuentre en el vehículo. Este sistema deberá brindar señales de alarma a un Centro de Control Terrestre en forma automática y a través de un dispositivo o botón de pánico; asimismo, deben contar con cobertura total dentro de las rutas establecidas para el transporte. El seguimiento de la situación de los vehículos durante el servicio debe ser continuo y permanente mientras la mercadería esté siendo trasladada y se debe contar con un plan de contingencias y sistema de respuesta rápida ante ocurrencias, asaltos y/o situaciones de emergencia."]
["·         Que los Conductores deben utilizar medios alternos de comunicación, tales como equipos de radio y/o teléfonos celulares y mantener comunicación permanente con los centros de control durante el traslado de la mercancía."]
["·         Que los Conductores de vehículos propios y de terceros no deberán realizar jornadas de conducción continúas de más de cinco (05) horas para el servicio diurno o más de cuatro (04) horas en el servicio nocturno. Tras alcanzar el periodo máximo de conducción continua, el Conductor hará una pausa ininterrumpida de por lo menos 45 minutos. La duración acumulada de jornadas de conducción no deberá exceder de diez (10) horas en un periodo de veinte y cuatro (24) horas, contadas desde la hora de inicio de la conducción en un servicio."]
[]
["La inobservancia de estas Condiciones Especiales liberará de toda responsabilidad indemnizatoria a la Compañía de Seguros. "]
[]
[]
["EXCLUSIONES",null,null,null,null,null,null,null,null,null,null,null,null,null,"OK"]
[]
["a)    Actos de deshonestidad cometidos por los empleados del Asegurado cuando la mercancía sea transportada en vehículos de propiedad del Asegurado y/o de terceros bajo su responsabilidad. "]
["b)    Olvido y/o negligencia y/o embriaguez de los empleados y/o personas encargadas del transporte y custodia de acuerdo a la Ley, cuando la mercancía sea transportada en vehículos de propiedad el Asegurado y/o de terceros bajo su responsabilidad. "]
["c)    Robo por escape, ratería, hurto, estafa, engaño, sustracciones sistemáticas, fraude o desaparición, cuando la mercancía sea transportada en vehículos de propiedad del Asegurado y/o de terceros bajo su responsabilidad. "]
["d)    Robo por desaparición mientras los objetos asegurados o el medio transportador se encuentre dentro de algún local o recinto del Asegurado o de terceros, en calidad de depositarios y no como parte del tránsito ordinario. "]
["e)    Pérdidas y/o daños causados a la mercancía asegurada como consecuencia de choques contra puentes y/o túneles durante su traslado terrestre, hasta su destino final."]
["f)     El contratante de la póliza podrá contratar a todos los transportistas que cumplan con las condiciones de la póliza; los Transportistas contratados no podrán subcontratar a otros transportistas"]
[]
["REAJUSTE DE PRIMAS ",null,null,null,null,null,null,null,null,null,null,null,null,null,"OK"]
["La Compañía se reserva el derecho de efectuar revisiones de la Póliza y reajustar las Tasas y deducibles de acuerdo al índice de siniestralidad que presente la Póliza, previo acuerdo con el Asegurado y/o Broker de seguros. "]
[]
[]
["DEDUCIBLES"]
[null,"Para robo por asalto:",null,"20% del monto indemnizable, mínimo US$ 500"]
[null,"Para otros riesgos: ",null,"10% del monto indemnizable, mínimo US$ 200"]
[]
[]
[null,"ESQUEMA DE PRIMAS NETAS"]
[]
[null,"Prima Comercial + IGV",null,null,{"$f":"TransportistaTerrestre!$E$112","v":345}]
[null,"Movimiento Anual (en USD)",null,null,{"$f":"CuestionarioTransporte!$D$24","v":0}]
[]
["Cordialmente,"]
[]
[{"$f":"+TODAY()","v":"2023-03-21"}]

{"sheet":"tablaTransportes","index":22,"n_rows":4,"n_cols":8,"rows_kept":4,"cut":false,"hidden":false,"merged":[]}
[null,null,null,null,null,null,"CELDA D24"]
[null,null,null,"MAE <= 3MM","MAE > 3 MM y <= 5 MM",null,{"$f":"\"Movimiento Anual (en USD) Mínimo USD \" & TEXT($H$3,\"#,##\")","v":"Movimiento Anual (en USD) Mínimo USD 150,000"}]
[null,null,"TRANSPORTES CON INCENDIO",2.3E-3,8.8000000000000003E-4,null,"Mínimo USD ",150000]
[null,null,"TRANSPORTES SIN INCENDIO",3.5899999999999999E-3,1.3700000000000001E-3,null,"Maximo USD ",2000000]

{"sheet":"Hoja1","index":23,"n_rows":711,"n_cols":30,"rows_kept":711,"cut":false,"hidden":true,"merged":[[693,0,693,12],[695,0,695,12],[696,0,696,12],[710,0,710,1],[686,0,686,12],[688,0,688,12],[689,0,689,12],[690,0,690,12],[691,0,691,12],[692,0,692,12],[678,0,678,12],[679,0,679,12],[680,0,680,12],[681,0,681,12],[682,0,682,12],[684,0,684,12],[669,0,669,12],[671,0,671,12],[673,0,673,12],[675,0,675,12],[676,0,676,12],[677,0,677,12],[657,0,657,12],[659,0,659,12],[661,0,661,12],[663,0,663,12],[665,0,665,12],[667,0,667,12],[649,2,649,12],[650,2,650,12],[651,2,651,12],[652,2,652,12],[653,2,653,12],[654,2,654,12],[642,0,642,12],[644,2,644,12],[645,2,645,12],[646,2,646,12],[647,2,647,12],[648,2,648,12],[631,0,631,12],[632,0,632,12],[633,0,633,12],[634,0,634,12],[637,0,637,12],[639,0,639,12],[625,0,625,12],[626,0,626,12],[627,0,627,12],[628,0,628,12],[629,0,629,12],[630,0,630,12],[619,0,619,12],[620,0,620,12],[621,0,621,12],[622,0,622,12],[623,0,623,12],[624,0,624,12],[611,0,611,12],[612,0,612,12],[614,0,614,12],[615,0,615,12],[617,0,617,12],[618,0,618,12],[597,0,597,12],[601,3,601,12],[603,3,603,12],[605,3,605,12],[608,0,608,12],[609,0,609,12],[579,2,579,3],[579,6,579,7],[590,0,590,12],[591,0,591,12],[595,0,595,12],[596,0,596,12],[566,2,566,8],[567,2,567,5],[568,2,568,5],[569,2,569,5],[570,2,570,5],[577,2,577,8],[558,2,558,12],[559,2,559,12],[560,2,560,12],[561,2,561,8],[563,2,563,8],[564,2,564,8],[550,3,550,4],[551,3,551,4],[554,0,554,12],[555,2,555,8],[556,2,556,12],[557,2,557,12],[541,0,541,12],[543,3,543,4],[546,2,546,3],[547,2,547,3],[548,2,548,3],[549,2,549,3],[528,4,528,8],[529,4,529,8],[530,4,530,8],[533,4,533,8],[536,4,536,8],[539,4,539,8],[493,0,496,12],[501,0,501,12],[505,0,507,12],[511,0,511,12],[512,3,512,9],[514,0,514,12],[482,0,482,12],[484,0,485,12],[486,0,486,12],[487,0,488,11],[489,0,490,12],[491,0,491,12],[467,0,467,12],[470,0,470,12],[472,0,473,12],[474,0,475,12],[477,0,477,12],[479,0,480,12],[457,0,458,12],[459,0,460,12],[461,0,461,12],[463,0,463,12],[465,0,465,12],[466,0,466,12],[442,0,442,12],[445,0,445,12],[449,0,450,12],[451,0,451,12],[452,0,453,12],[454,0,455,12],[407,0,408,12],[409,0,409,12],[410,0,411,12],[412,0,413,12],[414,0,415,12],[434,0,435,6],[369,1,370,4],[369,5,370,6],[369,8,370,9],[369,11,370,12],[399,0,399,12],[405,0,406,12],[364,1,366,4],[364,5,366,6],[364,8,366,9],[364,11,366,12],[367,1,368,4],[367,5,368,6],[367,8,368,9],[367,11,368,12],[360,1,360,4],[360,5,360,6],[360,8,360,9],[360,11,360,12],[361,1,363,4],[361,5,363,6],[361,8,363,9],[361,11,363,12],[354,1,354,4],[354,5,354,6],[354,8,354,9],[354,11,354,12],[355,1,356,4],[355,5,356,6],[355,8,356,9],[355,11,356,12],[327,0,327,12],[331,0,334,12],[337,0,337,12],[340,0,340,12],[343,0,346,12],[353,5,353,6],[353,8,353,9],[353,11,353,12],[287,0,287,4],[288,0,288,4],[289,0,289,4],[290,0,290,4],[310,0,312,12],[317,0,319,12],[281,0,281,4],[282,0,282,4],[283,0,283,4],[284,0,284,4],[285,0,285,4],[286,0,286,4],[259,0,259,6],[265,0,266,6],[268,0,268,12],[271,0,271,12],[275,0,277,12],[280,5,280,6],[280,8,280,9],[280,11,280,12],[235,1,235,4],[235,5,235,6],[235,8,235,9],[235,11,235,12],[236,1,236,4],[236,5,236,6],[236,8,236,9],[236,11,236,12],[231,1,231,4],[231,5,231,6],[231,8,231,9],[231,11,231,12],[232,1,234,4],[232,5,234,6],[232,8,234,9],[232,11,234,12],[225,1,227,4],[225,5,227,6],[225,8,227,9],[225,11,227,12],[230,5,230,6],[230,8,230,9],[230,11,230,12],[210,0,210,12],[214,0,216,12],[223,5,223,6],[223,8,223,9],[223,11,223,12],[224,1,224,4],[224,5,224,6],[224,8,224,9],[224,11,224,12],[181,0,181,3],[184,0,185,12],[191,0,192,12],[193,0,193,6],[203,0,204,12],[207,0,207,12],[172,1,172,4],[172,5,172,6],[172,8,172,9],[172,11,172,12],[173,1,173,4],[173,5,173,6],[173,8,173,9],[173,11,173,12],[170,5,170,6],[170,8,170,9],[170,11,170,12],[171,1,171,4],[171,5,171,6],[171,8,171,9],[171,11,171,12],[165,1,165,4],[165,5,165,6],[165,8,165,9],[165,11,165,12],[166,1,166,4],[166,5,166,6],[166,8,166,9],[166,11,166,12],[134,0,138,6],[139,0,140,12],[147,0,147,12],[150,0,150,12],[154,0,157,12],[164,5,164,6],[164,8,164,9],[164,11,164,12],[114,0,114,6],[115,0,116,6],[120,0,120,2],[120,3,120,6],[126,0,126,12],[132,0,132,7],[81,1,81,4],[81,5,81,6],[81,8,81,9],[81,11,81,12],[103,0,103,3],[112,0,113,12],[78,1,79,4],[78,5,79,6],[78,8,79,9],[78,11,79,12],[80,1,80,4],[80,5,80,6],[80,8,80,9],[80,11,80,12],[71,1,74,4],[71,5,74,6],[71,8,74,9],[71,11,74,12],[75,1,77,4],[75,5,77,6],[75,8,77,9],[75,11,77,12],[68,1,68,4],[68,5,68,6],[68,8,68,9],[68,11,68,12],[69,1,70,4],[69,5,70,6],[69,8,70,9],[69,11,70,12],[58,5,60,6],[58,8,60,9],[58,11,60,12],[64,0,64,12],[67,5,67,6],[67,8,67,9],[67,11,67,12],[50,0,50,4],[51,0,51,4],[56,5,56,6],[56,8,56,9],[56,11,56,12],[57,0,57,4],[57,5,57,6],[57,8,57,9],[57,11,57,12],[44,0,44,4],[45,0,45,4],[46,0,46,4],[47,0,47,4],[48,0,48,4],[49,0,49,4],[32,0,35,12],[38,0,38,6],[41,5,41,6],[41,8,41,9],[41,11,41,12],[42,5,42,6],[42,8,42,9],[42,11,42,12],[24,1,24,12],[25,1,25,12],[27,0,27,12],[29,0,29,12],[11,0,11,1],[13,0,13,12],[15,0,15,1],[15,2,15,12],[18,2,18,12],[19,2,19,12],[0,0,0,12],[3,0,3,12],[7,0,7,1],[7,2,7,12],[8,0,9,6],[10,0,10,1],[10,2,10,12],[20,2,20,12],[23,1,23,12]]}
["SLIP COTIZACIÓN PROTECCIÓN PARA TU NEGOCIO 2016"]
[]
[]
["PROTECCIÓN PARA NEGOCIO"]
[]
[]
[]
["CONTRATANTE",null,{"$f":"#REF! & \" \" &#REF! & \" \" &#REF!","v":{"$error":"#REF!"}}]
[]
[]
["CORREDOR",null,{"$f":"#REF!","v":{"$error":"#REF!"}}]
["VIGENCIA",null,{"$f":"PagodePrimasLocal1!$N$22","v":""},"al",{"$f":"+IF(C12=\"\",\"\",IF(DAY(C12)<10,0&DAY(C12),DAY(C12))&\"/\"&IF(MONTH(C12)<10,0&MONTH(C12),MONTH(C12))&\"/\"&YEAR(C12)+1)","v":""},"12:00 Hrs"]
[]
["CONDICIONES PARTICULARES"]
[]
["ASEGURADO",null,{"$f":"#REF! & \" \" &#REF! & \" \" &#REF!","v":{"$error":"#REF!"}}]
[]
["ACTIVIDAD O GIRO DEL NEGOCIO        "]
["Local 1",null,{"$f":"#REF!","v":{"$error":"#REF!"}}]
["Local 2",null,{"$f":"#REF!","v":{"$error":"#REF!"}}]
["Local 3",null,{"$f":"#REF!","v":{"$error":"#REF!"}}]
[]
["DIRECCIÓN DE LOS LOCALES POR ASEGURAR"]
["Local 1",{"$f":"#REF! & \" \" &#REF! & \" \" &#REF!","v":{"$error":"#REF!"}}]
["Local 2",{"$f":"#REF! & \" \" &#REF! & \" \" &#REF!","v":{"$error":"#REF!"}}]
["Local 3",{"$f":"#REF! & \" \" &#REF! & \" \" &#REF!","v":{"$error":"#REF!"}}]
[]
["PROTECCIÓN PARA NEGOCIO"]
[]
["SECCIÓN INCENDIO Y LÍNEAS ALIADAS"]
[]
["A. MATERIA DEL SEGURO"]
["Toda propiedad, , comprendiendo también maquinaria, equipos fijo, equipo móviles dentro y fuera de los predios asegurados, sea de propiedad del ASEGURADO y/o de terceros que se encuentren bajo su responsabilidad, supervisión , control y custodia  siempre que formen parte de los Valores Declarados en la Póliza, en locales propios y/o de terceros señalados en póliza, en forma permanente o temporal incluyendo bienes a la intemperie (siempre que debido a su naturaleza, deban estar bajo esa condición)."]
[]
[]
[]
[]
["B. MODALIDAD DE "]
[]
[]
["C. BIENES ASEGURADOS Y VALORES DECLARADOS"]
[null,null,null,null,null,"Local 1",null,null,"Local 2",null,null,"Local 3"]
[null,null,null,null,null,"Valor Declarado",null,null,"Valor Declarado",null,null,"Valor Declarado"]
[null,null,null,null,null,"Total","Endosado",null,"Total","Endosado",null,"Total","Endosado"]
["Edificio y/o Instalaciones fijas (sin considerar el valor del terreno ni Instalaciones Fijas)",null,null,null,null,{"$f":"IF(CoberturasaElegirLocal1!$M$11=\"\",\"\",CoberturasaElegirLocal1!$M$11)","v":""},{"$f":"IF(CoberturasaElegirLocal1!$N$11=\"\",\"\",CoberturasaElegirLocal1!$N$11)","v":""},null,{"$f":"IF(CoberturasaElegirLocal2!$M$11=\"\",\"\",CoberturasaElegirLocal2!$M$11)","v":""},{"$f":"IF(CoberturasaElegirLocal2!$N$11=\"\",\"\",CoberturasaElegirLocal2!$N$11)","v":""},null,{"$f":"IF(CoberturasaElegirLocal3!$M$11=\"\",\"\",CoberturasaElegirLocal3!$M$11)","v":""},{"$f":"IF(CoberturasaElegirLocal3!$N$11=\"\",\"\",CoberturasaElegirLocal3!$N$11)","v":""}]
["Instalaciones Fijas",null,null,null,null,{"$f":"IF(CoberturasaElegirLocal1!$M$12=\"\",\"\",CoberturasaElegirLocal1!$M$12)","v":""},{"$f":"IF(CoberturasaElegirLocal1!$N$12=\"\",\"\",CoberturasaElegirLocal1!$N$12)","v":""},null,{"$f":"IF(CoberturasaElegirLocal2!$M$12=\"\",\"\",CoberturasaElegirLocal2!$M$12)","v":""},{"$f":"IF(CoberturasaElegirLocal2!$N$12=\"\",\"\",CoberturasaElegirLocal2!$N$12)","v":""},null,{"$f":"IF(CoberturasaElegirLocal3!$M$12=\"\",\"\",CoberturasaElegirLocal3!$M$12)","v":""},{"$f":"IF(CoberturasaElegirLocal3!$N$12=\"\",\"\",CoberturasaElegirLocal3!$N$12)","v":""}]
["Mobiliario y/o Contenido propios del giro",null,null,null,null,{"$f":"IF(CoberturasaElegirLocal1!$M$13=\"\",\"\",CoberturasaElegirLocal1!$M$13)","v":""},{"$f":"IF(CoberturasaElegirLocal1!$N$13=\"\",\"\",CoberturasaElegirLocal1!$N$13)","v":""},null,{"$f":"IF(CoberturasaElegirLocal2!$M$13=\"\",\"\",CoberturasaElegirLocal2!$M$13)","v":""},{"$f":"IF(CoberturasaElegirLocal2!$N$13=\"\",\"\",CoberturasaElegirLocal2!$N$13)","v":""},null,{"$f":"IF(CoberturasaElegirLocal3!$M$13=\"\",\"\",CoberturasaElegirLocal3!$M$13)","v":""},{"$f":"IF(CoberturasaElegirLocal3!$N$13=\"\",\"\",CoberturasaElegirLocal3!$N$13)","v":""}]
["Existencias propias del giro del negocio",null,null,null,null,{"$f":"IF(CoberturasaElegirLocal1!$M$14=\"\",\"\",CoberturasaElegirLocal1!$M$14)","v":""},{"$f":"IF(CoberturasaElegirLocal1!$N$14=\"\",\"\",CoberturasaElegirLocal1!$N$14)","v":""},null,{"$f":"IF(CoberturasaElegirLocal2!$M$14=\"\",\"\",CoberturasaElegirLocal2!$M$14)","v":""},{"$f":"IF(CoberturasaElegirLocal2!$N$14=\"\",\"\",CoberturasaElegirLocal2!$N$14)","v":""},null,{"$f":"IF(CoberturasaElegirLocal3!$M$14=\"\",\"\",CoberturasaElegirLocal3!$M$14)","v":""},{"$f":"IF(CoberturasaElegirLocal3!$N$14=\"\",\"\",CoberturasaElegirLocal3!$N$14)","v":""}]
["Maquinaria propia del giro del negocio",null,null,null,null,{"$f":"IF(CoberturasaElegirLocal1!$M$15=\"\",\"\",CoberturasaElegirLocal1!$M$15)","v":""},{"$f":"IF(CoberturasaElegirLocal1!$N$15=\"\",\"\",CoberturasaElegirLocal1!$N$15)","v":""},null,{"$f":"IF(CoberturasaElegirLocal2!$M$15=\"\",\"\",CoberturasaElegirLocal2!$M$15)","v":""},{"$f":"IF(CoberturasaElegirLocal2!$N$15=\"\",\"\",CoberturasaElegirLocal2!$N$15)","v":""},null,{"$f":"IF(CoberturasaElegirLocal3!$M$15=\"\",\"\",CoberturasaElegirLocal3!$M$15)","v":""},{"$f":"IF(CoberturasaElegirLocal3!$N$15=\"\",\"\",CoberturasaElegirLocal3!$N$15)","v":""}]
["Equipos electrónicos propios del giro del negocio",null,null,null,null,{"$f":"IF(CoberturasaElegirLocal1!$M$16=\"\",\"\",CoberturasaElegirLocal1!$M$16)","v":""},{"$f":"IF(CoberturasaElegirLocal1!$N$16=\"\",\"\",CoberturasaElegirLocal1!$N$16)","v":""},null,{"$f":"IF(CoberturasaElegirLocal2!$M$16=\"\",\"\",CoberturasaElegirLocal2!$M$16)","v":""},{"$f":"IF(CoberturasaElegirLocal2!$N$16=\"\",\"\",CoberturasaElegirLocal2!$N$16)","v":""},null,{"$f":"IF(CoberturasaElegirLocal3!$M$16=\"\",\"\",CoberturasaElegirLocal3!$M$16)","v":""},{"$f":"IF(CoberturasaElegirLocal3!$N$16=\"\",\"\",CoberturasaElegirLocal3!$N$16)","v":""}]
["Lucro Cesante – Cédula A - Utilidad Bruta Anual ó\nGastos Fijos (Estables)",null,null,null,null,{"$f":"IF(CoberturasaElegirLocal1!$M$17=\"\",\"\",CoberturasaElegirLocal1!$M$17)","v":""},null,null,{"$f":"IF(CoberturasaElegirLocal2!$M$17=\"\",\"\",CoberturasaElegirLocal2!$M$17)","v":""},null,null,{"$f":"IF(CoberturasaElegirLocal3!$M$17=\"\",\"\",CoberturasaElegirLocal3!$M$17)","v":""}]
["TOTAL VALOR DECLARADO (Máximo hasta 2'000,000 USD)",null,null,null,null,{"$f":"IF(CoberturasaElegirLocal1!$M$18=\"\",\"\",CoberturasaElegirLocal1!$M$18)","v":""},{"$f":"IF(OR(CoberturasaElegirLocal1!$N$18=\"\",CoberturasaElegirLocal1!$N$18=0),\"\",CoberturasaElegirLocal1!$N$18)","v":""},null,{"$f":"IF(CoberturasaElegirLocal2!$M$18=\"\",\"\",CoberturasaElegirLocal2!$M$18)","v":""},{"$f":"IF(OR(CoberturasaElegirLocal2!$N$18=\"\",CoberturasaElegirLocal2!$N$18=0),\"\",CoberturasaElegirLocal2!$N$18)","v":""},null,{"$f":"IF(CoberturasaElegirLocal3!$M$18=\"\",\"\",CoberturasaElegirLocal3!$M$18)","v":""},{"$f":"IF(OR(CoberturasaElegirLocal3!$N$18=\"\",CoberturasaElegirLocal3!$N$18=0),\"\",CoberturasaElegirLocal3!$N$18)","v":""}]
[]
["D. MODALIDAD DE ASEGURAMIENTO"]
["A Valor Total"]
[]
["E. COBERTURAS Y SUMAS ASEGURADAS",null,null,null,null,"Local 1",null,null,"Local 2",null,null,"Local 3"]
["COBERTURA ",null,null,null,null,"Suma Asegurada US$",null,null,"Suma Asegurada US$",null,null,"Suma Asegurada US$"]
["Todo Riesgo Incendio y Líneas Aliadas",null,null,null,null,{"$f":"IF(SUM(F52)<>0,SUM(F52),\"\")","v":""},null,null,{"$f":"IF(SUM(I52)<>0,SUM(I52),\"\")","v":""},null,null,{"$f":"IF(SUM(L52)<>0,SUM(L52),\"\")","v":""}]
["Límite Único y Combinado para Todo Riesgo Incendio y Líneas Aliadas"]
["Lucro Cesante periodo de indemnización 12 meses."]
[]
[]
[]
["PROTECCIÓN PARA NEGOCIO"]
[]
["F. SUBLÍMITES"]
[null,null,null,null,null,"Local 1",null,null,"Local 2",null,null,"Local 3"]
[null,"Sublímite*",null,null,null,"Límite",null,null,"Límite",null,null,"Límite"]
[null,"Huelga, Motín, Conmoción Civil, Daño Malicioso, Vandalismo y /o Terrorismo en el agregado por vigencia.(Límite Único y Combinado)",null,null,null,{"$f":"F59","v":""},null,null,{"$f":"I59","v":""},null,null,{"$f":"L59","v":""}]
[]
[null,"Gastos Extraordinarios: (Límite Único y Combinado), tales como:\n- Honorarios de Arquitectos, topógrafos e Ingenieros\n- Documentos y Modelos\n- Remoción de Escombros",null,null,null,{"$f":"IF(ISERROR(IF(0.2*F59>400000,400000,0.2*F59)),0,(IF(0.2*F59>400000,400000,0.2*F59)))","v":0},null,null,{"$f":"IF(ISERROR(IF(0.2*I59>400000,400000,0.2*I59)),0,(IF(0.2*I59>400000,400000,0.2*I59)))","v":0},null,null,{"$f":"IF(ISERROR(IF(0.2*L59>400000,400000,0.2*L59)),0,(IF(0.2*L59>400000,400000,0.2*L59)))","v":0}]
[]
[]
[]
[null,"Cobertura Automática para Nuevas Adquisiciones, máximo 30 días para declaración a PACIFICO.\nAplica sólo si cuenta con contenido y equipos y maquinaria",null,null,null,{"$f":"IF(ISERROR(IF(0.2*F59>100000,100000,0.2*F59)),0,IF(0.2*F59>100000,100000,0.2*F59))","v":0},null,null,{"$f":"IF(ISERROR(IF(0.2*I59>100000,100000,0.2*I59)),0,IF(0.2*I59>100000,100000,0.2*I59))","v":0},null,null,{"$f":"IF(ISERROR(IF(0.2*L59>100000,100000,0.2*L59)),0,IF(0.2*L59>100000,100000,0.2*L59))","v":0}]
[]
[]
[null,"Rotura Accidental de Vidrios, Cristales y/o Avisos luminosos. Aplica para contenido y edificación.",null,null,null,{"$f":"IF(ISERROR(IF(0.1*F59>5000,5000,0.1*F59)),0,IF(0.1*F59>5000,5000,0.1*F59))","v":0},null,null,{"$f":"IF(ISERROR(IF(0.1*I59>5000,5000,0.1*I59)),0,IF(0.1*I59>5000,5000,0.1*I59))","v":0},null,null,{"$f":"IF(ISERROR(IF(0.1*L59>5000,5000,0.1*L59)),0,IF(0.1*L59>5000,5000,0.1*L59))","v":0}]
[]
[null,"Gastos Extras",null,null,null,{"$f":"IF(ISERROR(IF(0.2*F59>400000,400000,0.2*F59)),0,IF(0.2*F59>400000,400000,0.2*F59))","v":0},null,null,{"$f":"IF(ISERROR(IF(0.2*I59>400000,400000,0.2*I59)),0,IF(0.2*I59>400000,400000,0.2*I59))","v":0},null,null,{"$f":"IF(ISERROR(IF(0.2*L59>400000,400000,0.2*L59)),0,IF(0.2*L59>400000,400000,0.2*L59))","v":0}]
[null,"Refrigeración (L.A.A.)**",null,null,null,{"$f":"IF(ISERROR(IF(DatosdelNegocioLocal1!$AH$5=\"A\",20000,\"\")),0,(IF(DatosdelNegocioLocal1!$AH$5=\"A\",20000,\"\")))","v":""},null,null,{"$f":"IF(ISERROR(IF(DatosdelNegocioLocal1!$AH$5=\"A\",20000,\"\")),0,(IF(DatosdelNegocioLocal1!$AH$5=\"A\",20000,\"\")))","v":""},null,null,{"$f":"IF(ISERROR(IF(DatosdelNegocioLocal1!$AH$5=\"A\",20000,\"\")),0,(IF(DatosdelNegocioLocal1!$AH$5=\"A\",20000,\"\")))","v":""}]
[null,"*: Foman parte de la Suma Asegurada, no son adicionales"]
[null,"**: $ 5,000 por evento."]
[]
["G. CONDICIONADOS Y CLÁUSULAS APLICABLES A ESTA SECCIÓN"]
[]
["990000 - Claúsulas Generales de Contratación para Riesgos Generales"]
["Condicionado General Multi-Riesgo Negocios."]
["010005 - Cláusula Todo Riesgo."]
["010027 - Claúsula para Pérdidas y Daños por Huelga, Motín y Conmoción Civil."]
["010028 - Claúsula para Pérdidas o Daños por Vandalismo, Terrorismo y Daño Malicioso."]
["010029 - Claúsula para Gastos Extras"]
["010024 - Claúsula para Gastos Extraordinarios"]
["010006 - Claúsula de Refrigeración."]
["010010 - Cláusula de cobertura automática por nuevas adquisiciones."]
["010003 - Cláusula de rotura de cristales y/o vidrios."]
["990001 - Cláusula de Terceros."]
["990003 - Cláusula de rehabilitación automática de la suma asegurada (condición PPS)."]
["010038 - Claúsula de reemplazo."]
["010012 - Claúsula de Traslado temporal. "]
["010011 - Claúsula de Propiedades fuera de control del Asegurado. "]
["010013 - Claúsula de Errores u omisiones."]
["-      Cláusula de transporte incidental."]
["LUCRO CESANTE"]
["−      011000 CONDICIONADO GENERAL DE LUCRO CESANTE POR INCENDIO"]
["−      011001 – CL. PARA LUCRO CESANTE FORMA INGLESA CÉDULA A"]
["Asistencia para el negocio."]
[{"$f":"+IF(DatosdelNegocioLocal1!$AH$5=\"A\",\"Clausula de refrigeración\",\"\")","v":""}]
[]
["H. DEDUCIBLES (POR TODA Y CADA PÉRDIDA)"]
[]
["Terremoto, temblor, erupción volcánica, fuego subterráneo, maremoto (tsunami), salida mar, marejada u oleaje: 1% del valor declarado del predio afectado y/o su contenido y/o sus existencias, mínimo US$ 1,000"]
[]
["Otros riesgos de la naturaleza: 1% del valor declarado del predio afectado y/o su contenido y/o sus existencias, mínimo US$ 1,000"]
["Huelga, conmoción civil, asonada, daño malicioso y vandalismo, sabotaje y/o terrorismo: 10% del monto indemnizable mínimo US$ 1,000"]
[]
["Rotura Accidental de Vidrios, Cristales y/o Avisos Luminosos: 10% del monto indemnizable mínimo US$ 50.00"]
["Gastos Extras:  3 días"]
["Demás Coberturas:  5 % del Monto Indemnizable, mínimo US$ 500.00"]
["-      Lucro Cesante, 7 días,"]
["Transporte Incidental: 10% del monto indemnizable mínimo US$ 100.00"]
[]
[]
[]
[]
["PROTECCIÓN PARA NEGOCIO"]
[]
[]
["I. CONDICIONES ESPECIALES APLICABLES ESTA SECCIÓN"]
[]
["LAS COBERTURAS ADICIONALES FORMAN PARTE DEL LIMITE PRINCIPAL"]
["-         La presente sección no cubre Lucro Cesante Contingente en cualquiera de sus modalidades. "]
[]
["Las siguientes cláusulas son de aplicación siempre y cuando la presente poliza se encuentre endosada a algún banco y/o entidad financiera:\n- clausula de reemplazo hasta 3 años de antiguedad.\n- traslado temporal. \n- propiedades fuera de control del asegurado. \n- errores u omisiones."]
[]
[]
[]
[]
["La clausula de refrigeración es de aplicacion siempre y cuando corresponda a cualquiera de las siguientes actividades: restaurantes, hoteles,panaderías, heladerías, carnicerías y bodegas."]
[]
["J. GARANTÍAS APLICABLES ESTA SECCIÓN"]
[]
["I. La empresa deberá contar con licencia de funcionamiento vigente."]
["II. El local deberá contar con extintor vigente."]
[]
[]
["PROTECCIÓN PARA NEGOCIO"]
[]
[]
["SECCIÓN ROTURA DE MAQUINARIA"]
[]
["A. MATERIA DEL SEGURO"]
[]
["Maquinaria y equipo, fijo y estacionario en general de propiedad del ASEGURADO y/o de terceros que guarden relación con el giro del negocio que se encuentren bajo su responsabilidad, supervisión, control y custodia siempre que formen parte de los Valores Declarados en la Póliza, en el local  señalado en póliza, en forma permanente o temporal  y que sea parte  o contribuyan directa o indirectamente con el proceso productivo o actividad del ASEGURADO."]
[]
[]
[]
[]
["B. MODALIDAD DE ASEGURAMIENTO"]
[]
["A PRIMER RIESGO"]
[]
["C. COBERTURAS Y SUMAS ASEGURADAS"]
[null,null,null,null,null,"Local 1",null,null,"Local 2",null,null,"Local 3"]
[null,"Cobertura",null,null,null,"Suma Asegurada",null,null,"Suma Asegurada",null,null,"Suma Asegurada"]
[null,"Daño Material – Básica",null,null,null,{"$f":"+CoberturasaElegirLocal1!$N$23","v":""},null,null,{"$f":"+CoberturasaElegirLocal2!$N$23","v":""},null,null,{"$f":"+CoberturasaElegirLocal3!$N$23","v":""}]
[]
[]
["D. SUBLÍMITES"]
[null,null,null,null,null,"Local 1",null,null,"Local 2",null,null,"Local 3"]
[null,"Sub Limites",null,null,null,"Límite US$",null,null,"Límite US$",null,null,"Límite US$"]
[null,"Gastos adicionales por horas extras, trabajo nocturno, trabajo en días festivos, flete expreso, Límite Único y Combinado",null,null,null,"Hasta el 100% de Suma Asegurada, Hasta $ 10,000 ",null,null,"Hasta el 100% de Suma Asegurada, Hasta $ 10,000 ",null,null,"Hasta el 100% de Suma Asegurada, Hasta $ 10,000 "]
[null,"Flete aéreo.",null,null,null,"Hasta el 100% de Suma Asegurada, Hasta $ 10,000 ",null,null,"Hasta el 100% de Suma Asegurada, Hasta $ 10,000 ",null,null,"Hasta el 100% de Suma Asegurada, Hasta $ 10,000 "]
[]
["E. CONDICIONADOS Y CLÁUSULAS APLICABLES A ESTA SECCIÓN:"]
[]
["− 330007 CLÁUSULA PARA CUBRIR GASTOS ADICIONALES POR HORAS EXTRA, TRABAJO NOCTURNO, TRABAJO EN DÍAS FESTIVOS Y FLETE EXPRESO"]
["− 330006 CL.PARA CUBRIR GASTOS ADICIONALES PARA FLETE AÉREO"]
["− 330005 CL. DE EXCLUSIÓN DE EXPLOSIONES DE GASES DE ESCAPE EN CALDERAS Y HORNOS "]
["− 330013 CL. DE AJUSTE DE LA DEPRECIACIÓN PARA LA REPARACIÓN DE MOTORES DE COMBUSTIÓN INTERNA"]
["− 330028 CL.  VALOR NUEVO DE REPOSICION-RM "]
["−  990000 - Claúsulas Generales de Contratación para Riesgos Generales"]
["Condicionado General Multi-Riesgo Negocios."]
["330013 - clausula de ajuste de la depreciación para la reparación de motores de combustión  interna (p. ej. motores de gasolina, motores a gas). (obligatorio)"]
[]
["330012 - ajuste de depreciación en rebobinados maquinas eléctricas. (obligatorio)"]
[]
["F. DEDUCIBLES (POR TODA Y CADA PÉRDIDA)"]
[]
["Daño Material,  10% del monto indemnizable mínimo US$ 500."]
["-      Gastos adicionales por horas extras, trabajo nocturno, trabajo en días festivos, flete expreso. 10% del monto indemnizable mínimo US$ 200"]
[]
["-       Flete Aéreo 10% del monto indemnizable mínimo US$ 200"]
[]
["G. CONDICIONES ESPECIALES APLICABLES ESTA SECCIÓN"]
[]
["La presente  póliza se limita a amparar la maquinaria fija dentro del local declarado."]
["El Valor Declarado debe corresponder al valor de reposición a nuevo del equipo asegurado."]
["Valor Nuevo de reemplazo, aplicables para maquinaria hasta 2 años de antigüedad."]
[]
["H. GARANTÍAS APLICABLES ESTA SECCIÓN"]
[]
["Se debe contar, cumplir y documentar con el programa de Mantenimiento Preventivo, según indicaciones del fabricante para todos los equipos."]
[]
[]
[]
["PROTECCIÓN PARA NEGOCIO"]
[]
[]
["SECCIÓN EQUIPO ELECTRONICO"]
[]
["A. MATERIA DEL SEGURO"]
[]
["Equipos eléctricos y electrónicos instalados, de propiedad del ASEGURADO y/o de terceros que guarden relación con el giro del negocio bajo control, cuidado y custodia del ASEGURADO, dentro del local asegurado que formen parte del Valor Declarado y sea parte o contribuyan directa o indirectamente con el proceso productivo o actividad del ASEGURADO."]
[]
[]
[]
["B. MODALIDAD DE ASEGURAMIENTO"]
[]
["A PRIMER RIESGO"]
[]
["C. COBERTURAS Y SUMAS ASEGURADAS"]
[null,null,null,null,null,"Local 1",null,null,"Local 2",null,null,"Local 3"]
[null,"Coberturas",null,null,null,"Sumas Aseguradas",null,null,"Sumas Aseguradas",null,null,"Sumas Aseguradas"]
[null,"Todo Riesgo Equipo Electrónico Secciones I,II y III – Límite Único y Combinado, período de indemnización Sección III: 06 meses",null,null,null,{"$f":"+CoberturasaElegirLocal1!$N$26","v":""},null,null,{"$f":"+CoberturasaElegirLocal2!$N$26","v":""},null,null,{"$f":"+CoberturasaElegirLocal3!$N$26","v":""}]
[]
[]
[]
["D. SUBLÍMITES"]
[null,null,null,null,null,"Local 1",null,null,"Local 2",null,null,"Local 3"]
[null,"Sublímite",null,null,null,"Límite",null,null,"Límite",null,null,"Límite"]
[null,"Equipos Móviles y Portátiles fuera del predio limitado a Laptops y/o notebooks US$ 3,000 por evento y en el Agregado por vigencia.",null,null,null,{"$f":"CoberturasaElegirLocal1!$N$27","v":""},null,null,{"$f":"CoberturasaElegirLocal2!$N$27","v":""},null,null,{"$f":"CoberturasaElegirLocal3!$N$27","v":""}]
[]
[]
[null,"Gastos adicionales por horas extras, trabajo nocturno, trabajo en días festivos, flete expreso – por evento y en el Agregado por vigencia, Límite Único y Combinado",null,null,null,"Hasta el 100% de Suma Asegurada, Hasta $ 5,000 ",null,null,"Hasta el 100% de Suma Asegurada, Hasta $ 5,000 ",null,null,"Hasta el 100% de Suma Asegurada, Hasta $ 5,000 "]
[null,"Flete aéreo – por evento y en el Agregado Vigencia",null,null,null,"Hasta el 100% de Suma Asegurada, Hasta $ 5,000 ",null,null,"Hasta el 100% de Suma Asegurada, Hasta $ 5,000 ",null,null,"Hasta el 100% de Suma Asegurada, Hasta $ 5,000 "]
[]
["E. CONDICIONADOS Y CLÁUSULAS APLICABLES A ESTA SECCIÓN:"]
[]
["990000 - Claúsulas Generales de Contratación para Riesgos Generales"]
["Condicionado General Multi-Riesgo Negocios."]
["360002 - Cláusula de valor nuevo de reposición."]
["360015 - Cláusula sobre celebración de un contrato de mantenimiento."]
["360008 - Cláusula de obligaciones relativas a equipos de climatización."]
["360015 - Cláusula para servicios de mantenimiento y prestaciones del seguro."]
[{"$f":"+IF(F233=\"\",\"\",\"Cláusula para equipos móviles y portátiles fuera del predio asegurado.\")","v":""}]
["− 360027 CL. PARA CUBRIR GASTOS ADICIONALES PARA EL FLETE AÉREO"]
["− 360023 CL. DE COBERTURA DE EQUIPOS MÓVILES Y PORTÁTILES FUERA DE LOS PREDIOS ASEGURADOS"]
[]
["F. DEDUCIBLES (POR TODA Y CADA PÉRDIDA)"]
[" "]
["Secciones I y II,  10% del monto indemnizable mínimo US$  200"]
["Sección III : 3  días"]
[{"$f":"+IF(F233=\"\",\"\",\"Equipos Móviles y Portátiles fuera de los predios: 20 % del monto indemnizable mínimo US$ 500\")","v":""}]
["Gastos adicionales por horas extras, trabajo nocturno, trabajo en días festivos, flete expreso. 10% del monto indemnizable mínimo US$ 200"]
["Flete Aéreo 10% del monto indemnizable mínimo US$ 200"]
[]
["G. CONDICIONES ESPECIALES APLICABLES ESTA SECCIÓN"]
["Contar con duplicado de información backup, para efectos de la Sección II portadores externos de datos, en otro local del asegurado."]
["Se excluyen los daños causados por los programas denominados “virus informáticos”."]
["Se excluye la cobertura de robo para equipos electrónicos."]
[]
["H. GARANTÍAS APLICABLES ESTA SECCIÓN"]
["Todos los Equipos deberán contar con Estabilizador de Voltaje operativo."]
["Se debe contar, cumplir y documentar con el programa de Mantenimiento Preventivo, según indicaciones del fabricante para todos los equipos."]
[]
[]
["PROTECCIÓN PARA NEGOCIO"]
[]
[]
["SECCIÓN ROBO"]
[]
["A. MATERIA DEL SEGURO"]
[]
["Contenidos en el local asegurado incluyendo maquinaria y equipos, existencias en general y dinero en efectivo de propiedad del ASEGURADO y/o de terceros que guarden relación con el giro del negocio que se encuentren bajo su responsabilidad, supervisión, control y custodia siempre que formen parte de los Valores Declarados en la Póliza."]
[]
[]
[]
["B. BIENES ASEGURADOS Y VALORES DECLARADOS"]
[null,null,null,null,null,"Local 1",null,null,"Local 2",null,null,"Local 3"]
["Detalle",null,null,null,null,"Valor Declarado","Suma Asegurada Máxima",null,"Valor Declarado","Suma Asegurada Máxima",null,"Valor Declarado","Suma Asegurada Máxima"]
["Edificio (sin considerar el valor del terreno ni Instalaciones Fijas)",null,null,null,null,{"$f":"+CoberturasaElegirLocal1!$M$11","v":""},null,null,{"$f":"+CoberturasaElegirLocal2!$M$11","v":""},null,null,{"$f":"+CoberturasaElegirLocal3!$M$11","v":""}]
["Instalaciones fijas",null,null,null,null,{"$f":"+CoberturasaElegirLocal1!$M$31","v":""},null,null,{"$f":"+CoberturasaElegirLocal2!$M$31","v":""},null,null,{"$f":"+CoberturasaElegirLocal3!$M$31","v":""}]
["Mobiliario y/o contenido propios del giro del negocio",null,null,null,null,{"$f":"+CoberturasaElegirLocal1!$M$32","v":""},null,null,{"$f":"+CoberturasaElegirLocal2!$M$32","v":""},null,null,{"$f":"+CoberturasaElegirLocal3!$M$32","v":""}]
["Existencias propias del giro del negocio",null,null,null,null,{"$f":"+CoberturasaElegirLocal1!$M$33","v":""},null,null,{"$f":"+CoberturasaElegirLocal2!$M$33","v":""},null,null,{"$f":"+CoberturasaElegirLocal3!$M$33","v":""}]
["Maquinaria propia del giro del negocio",null,null,null,null,{"$f":"+CoberturasaElegirLocal1!$M$34","v":""},null,null,{"$f":"+CoberturasaElegirLocal2!$M$34","v":""},null,null,{"$f":"+CoberturasaElegirLocal3!$M$34","v":""}]
["Equipo electrónico fijo",null,null,null,null,{"$f":"+CoberturasaElegirLocal1!$M$35","v":""},null,null,{"$f":"+CoberturasaElegirLocal2!$M$35","v":""},null,null,{"$f":"+CoberturasaElegirLocal3!$M$35","v":""}]
["Dinero en Tránsito (LAA)",null,null,null,null,"---------",null,null,"---------",null,null,"---------"]
["Dinero y/o valores dentro del local (caja chica y/o caja registradora) solo en horas laborables (LAA)",null,null,null,null,{"$f":"+CoberturasaElegirLocal1!$M$36","v":"---------"},null,null,{"$f":"+CoberturasaElegirLocal2!$M$36","v":"---------"},null,null,{"$f":"+CoberturasaElegirLocal3!$M$36","v":"---------"}]
["Total:",null,null,null,null,{"$f":"+CoberturasaElegirLocal1!$M$18","v":""},{"$f":"IF(F291>100000,100000,F291)","v":100000},null,{"$f":"+CoberturasaElegirLocal2!$M$18","v":""},{"$f":"IF(I291>100000,100000,I291)","v":100000},null,{"$f":"+CoberturasaElegirLocal3!$M$18","v":""},{"$f":"IF(L291>100000,100000,L291)","v":100000}]
[]
["C. MODALIDAD DE ASEGURAMIENTO"]
[]
["A PRIMER RIESGO"]
[]
["D. CONDICIONADOS Y CLÁUSULAS APLICABLES A ESTA SECCIÓN:"]
[]
["990000 - Claúsulas Generales de Contratación para Riesgos Generales"]
["Condicionado General Multi-Riesgo Negocios."]
[{"$f":"+IF(G290=\"\",\"\",\"Cláusula para cubrir dinero en efectivo y o valores dentro del local asegurado, en Agregado por Vigencia.\")","v":""}]
[{"$f":"+IF(G289=\"\",\"\",\"410003 - Cláusula de Dinero en Efectivo y Valores en Tránsito desde Oficinas del Asegurado.\")","v":""}]
[]
["E. DEDUCIBLES (POR TODA Y CADA PÉRDIDA)"]
[]
["Robo y/o Asalto de Activos y/o Existencias: 10.00 % del monto indemnizable, mínimo US$ 500 toda y cada pérdida."]
[{"$f":"+IF(G289=\"\",\"\",\"Dinero en Tránsito y Dinero en Caja Chica: 10% del monto indemnizable mínimo USD250.00\")","v":""}]
[]
["F. CONDICIONES ESPECIALES APLICABLES ESTA SECCIÓN"]
[]
["No se ampara los bienes que se encuentran en patios, jardines, terrazas, azoteas que no tengan más defensa que muros perimétricos o en vitrinas fijas o movibles que se hallen colocadas fuera del edificio o de los ámbitos que constituyen el lugar del seguro."]
[]
[]
["No cubre almacenes de campo."]
[]
["G. GARANTÍAS APLICABLES ESTA SECCIÓN"]
[]
["1. Si la puerta es de una sola hoja, como mínimo dispondrá de una chapa sólida que se reforzará a su base o estará soldada a la misma; debe ser de no menos de 2 golpes.  Adicionalmente, la puerta de reja deberá protegerse con dos (02) candados con media luna protectora de bronce o puente protector metálico.  Si la puerta es de dos hojas; las medidas de seguridad serán las que se han mencionado, agregándole a la reja dos cerrojos verticales (uno al marco superior y otro al inferior) en cada hoja; en los que se colocarán un candado con media luna protectora de bronce."]
[]
[]
[]
[]
[]
[]
[]
[]
[]
["PROTECCIÓN PARA NEGOCIO"]
[]
[]
["CORTINAS ENROLLABLES"]
["2. Cuando el local cuente con cortinas enrollables que den hacia la calle, se deberá cumplir con los siguientes requisitos:\nA. Cada una de las cortinas metálicas enrollables deberá contar como mínimo con dos (2) argollas de fierro ancladas al piso, las cuales se sujetarán interiormente a las cortinas metálicas con un candado media luna protectora de bronce.\nB. Si la cortina dispone de puerta chica, ésta deberá contar como mínimo con dos chapas de tres golpes o más, y adicionalmente dos candados protegidos con puente protector o media luna protectora de bronce:\nC. Los carriles de la cortina enrollable deben estar reforzados tanto por dentro como por fuera, con ángulos de fierro de no menos de 3 pulgadas de ancho y como mínimo 1.50 metros con respecto al nivel del suelo.  Esta medida de seguridad no es necesario adoptarla si la cortina enrollable dispone de una sobre reja de fierro exteriormente."]
[]
[]
[]
[]
[]
["PROTECCIÓN PARA NEGOCIO"]
[]
[]
["SECCIÓN RESPONSABILIDAD CIVIL"]
[]
["A. MATERIA DEL SEGURO"]
["Sujeto a todos los términos y condiciones que forman parte de la presente Póliza, LA COMPAÑÍA cubre al ASEGURADO contra las reclamaciones de Terceros por concepto de Responsabilidad Civil Extracontractual, exclusivamente a consecuencia de Daños Personales y/o Daños Materiales causados involuntariamente a dichos Terceros por un accidente ocurrido durante la vigencia de la Póliza, como resultado directo de las actividades o negocios declarados en las Condiciones Particulares."]
[]
[]
[]
[]
["B. BASE DE COBERTURA"]
[]
["OCURRENCIA"]
[]
["C. COBERTURAS Y SUMAS ASEGURADAS"]
[null,null,null,null,null,"Local 1",null,null,"Local 2",null,null,"Local 3"]
[null,"Cobertura",null,null,null,"Suma Asegurada",null,null,"Suma Asegurada",null,null,"Suma Asegurada"]
[null,"Responsabilidad Civil Extracontractual en Límite Agregado por Vigencia.",null,null,null,{"$f":"+CoberturasaElegirLocal1!$N$40","v":50000},null,null,{"$f":"+CoberturasaElegirLocal2!$N$40","v":""},null,null,{"$f":"+CoberturasaElegirLocal3!$N$40","v":""}]
[]
[]
["D. SUBLÍMITES"]
[]
[null,"Cobertura",null,null,null,"Suma Asegurada",null,null,"Suma Asegurada",null,null,"Suma Asegurada"]
[null,"Alimentos y bebidas USD 5,000 POR EVENTO Y HASTA USD 20,000, como parte del límite principal y en Agregado Anual\nAplica para opción Hoteles y Restaurantes",null,null,null,{"$f":"+IF(F356=\"\",\"\",IF(OR(DatosdelNegocioLocal1!$AH$6=13,DatosdelNegocioLocal1!$AH$6=21),\"Aplica\",\"No Aplica\"))","v":"No Aplica"},null,null,{"$f":"+IF(I356=\"\",\"\",IF(OR(DatosdelNegocioLocal2!$AH$6=13,DatosdelNegocioLocal2!$AH$6=21),\"Aplica\",\"No Aplica\"))","v":""},null,null,{"$f":"+IF(L356=\"\",\"\",IF(OR(DatosdelNegocioLocal3!$AH$6=13,DatosdelNegocioLocal3!$AH$6=21),\"Aplica\",\"No Aplica\"))","v":""}]
[]
[]
[null,"Responsabilidad de Inkeepers USD 5,000 POR EVENTO Y HASTA USD 20,000 como parte del límite principal y en Agregado Anual\nAplica para opción Hoteles",null,null,null,{"$f":"+IF(F356=\"\",\"\",IF(OR(DatosdelNegocioLocal1!$AH$6=13,DatosdelNegocioLocal1!$AH$6=21),\"Aplica\",\"No Aplica\"))","v":"No Aplica"},null,null,{"$f":"+IF(I356=\"\",\"\",IF(OR(DatosdelNegocioLocal2!$AH$6=13,DatosdelNegocioLocal2!$AH$6=21),\"Aplica\",\"No Aplica\"))","v":""},null,null,{"$f":"+IF(L356=\"\",\"\",IF(OR(DatosdelNegocioLocal3!$AH$6=13,DatosdelNegocioLocal3!$AH$6=21),\"Aplica\",\"No Aplica\"))","v":""}]
[]
[]
[null,"Responsabilidad Civil Patronal en exceso de las pólizas de ley, limitado hasta USD 50,000 LUC.",null,null,null,{"$f":"+IF(F356=\"\",\"\",\"Aplica\")","v":"Aplica"},null,null,{"$f":"+IF(I356=\"\",\"\",\"Aplica\")","v":""},null,null,{"$f":"+IF(L356=\"\",\"\",\"Aplica\")","v":""}]
[]
[null,"Responsabilidad Civil Contractual",null,null,null,{"$f":"+IF(F356=\"\",\"\",\"Aplica\")","v":"Aplica"},null,null,{"$f":"+IF(I356=\"\",\"\",\"Aplica\")","v":""},null,null,{"$f":"+IF(L356=\"\",\"\",\"Aplica\")","v":""}]
[]
[]
["E. CONDICIONADOS Y CLÁUSULAS APLICABLES A ESTA SECCIÓN:"]
[]
["990000 - Claúsulas Generales de Contratación para Riesgos Generales"]
["Condicionado General Multi-Riesgo Negocios."]
["530006 - Cláusula de responsabilidad civil de locales y operaciones"]
["530010 - Cláusula de responsabilidad civil por incendio y/o explosión y/o agua y/o humo. "]
["530017 - Cláusula de responsabilidad civil por el empleo de ascensores, montacargas, grúas y escaleras mecánicas."]
["530016 - Cláusula de responsabilidad civil para playas de estacionamiento hasta USD 20,000 en  Límite Agregado Anual "]
["530004 - Claúsula de Responsabilidad Civil de Alimentos y Bebidas."]
["530008 - Claúsula de Responsabilidad Civil para Restaurantes, Bares, Cafés y similares."]
["530011 - Claúsula de Establecimientos de Baños Turcos, Baños públicos, saunas y similares."]
["530030 - Claúsula de Responsabilidad Civil de Oficinas, Bancos, Empresas de Seguros y similares."]
["530027 - Claúsula de Responsabilidad Civil de Hoteleros(Inkeeper´s Liability)"]
["530005 - Claúsula de Responsabilidad Civil de Colegios, universidades e institutos de enseñanza."]
["530015 - Claúsula de Responsabilidad Civil de Peluquerias, Institutos y Salones de belleza."]
["530018 - Claúsula de Responsabilidad Civil durante eventos sociales y culturales."]
["530019 - Cláusula de Responsabilidad Civil Patronal."]
["530022 - CL DE RESPONSABILIDAD CIVIL CONTRACTUAL"]
[]
["F. DEDUCIBLES (POR TODA Y CADA PÉRDIDA)"]
[]
["10% del monto indemnizable mínimo US$ 500 todo y cada reclamo."]
["(Inkeeper´s Liability) 10% del monto indemnizable mínimo US$ 300 todo y cada reclamo."]
[]
[]
[]
[]
["PROTECCIÓN PARA NEGOCIO"]
[]
[]
["G. CONDICIONES ESPECIALES APLICABLES ESTA SECCIÓN"]
[]
["EL LIMITE ASEGURADO ES UNICO EN AGREGADO ANUAL."]
["La “Cláusula de Responsabilidad Civil de Playas de Estacionamiento” está limitado a US$ 20,000 en Límite Agregado Anual y es aplicable únicamente a los rubros de Restaurantes y Hoteles."]
[]
["La “Cláusula de Responsabilidad Civil de Alimentos y bebidas” es de aplicación únicamente para los siguientes rubros: Restaurantes, Hoteles, Panaderías"]
[]
["La “Cláusula de Responsabilidad Civil de Hoteleros” (Inkeeper´s Liability es de aplicación únicamente para el rubro de Hoteles."]
["La Cláusula de Responsabilidad Civil de Oficinas, Bancos, Empresas de Seguros y similares es de aplicación únicamente para el rubro de Oficinas."]
[]
["La “Cláusula de Responsabilidad Civil de Colegios, universidades e Institutos de enseñanza”, es de aplicación únicamente para Colegios."]
[]
["La “Cláusula de Responsabilidad Civil de Peluquerías, Institutos y Salones de Belleza”, es de aplicación únicamente para Peluquerías y Salones de Belleza."]
[]
[]
["H. EXCLUSIONES"]
[]
["RC de productos"]
["RC derivada de actos delictivos cometidos por terceras personas"]
["RC profesional / errores y omisiones "]
["Multas y penalidades"]
["Rehabilitación automática de la suma asegurada"]
["Daños financieros puros"]
["Incumplimientos contractuales y compromiso asumido por contratos"]
["D & O"]
["Reclamaciones por difamación, calumnia, injuria, delitos contra el honor"]
["Fallas de proveedores"]
["Caso fortuito o fuerza mayor"]
["Reclamos y/o demandas provenientes del extranjero"]
["Transporte y almacenamiento de mercadería peligrosa incluyendo hidrocarburos"]
["Bienes de terceros bajo cargo, custodia y control"]
["Daños a los bienes o propiedades de los asegurados"]
["RC derivada y relacionada con la violación de la propiedad intelectual, competencia desleal,\npublicidad adversa o perjudicial contra competidores"]
[]
["RC derivada de errores informáticos, virus, internet"]
["Trabajos terminados."]
["Daños a la carga y al medio transportador"]
["Contaminación gradual"]
["Garantía, retirada e ineficiencia de productos"]
[]
["PROTECCIÓN PARA NEGOCIO"]
[]
[]
["ASISTENCIAS"]
[]
["SERVICIOS MÉDICOS PARA EL NEGOCIO"]
[]
["Servicios de Ambulancia por Emergencia o Accidente, disponible las 24 horas del día todo el año, hasta un máximo de 03 atenciones por año de vigencia de la póliza, hasta S/. 350 por evento."]
[]
["Servicio de “Aló doctor”  para el asegurado y empleados, disponible las 24 horas del día todo el año, sin límite."]
["Servicios de “Doctor a domicilio”, para el asegurado y empleados, disponible las 24 horas del día, todo el año con copago de S/. 35 (no incluye medicinas ni exámenes médicos), sin límite.",null,null,null,null,null,null,null,null,null,null,null,null,null,null,null,null,null,null,null,null,null,null,null,null,null,null,null,null,2]
[]
["Un chequeo preventivo anual gratuito (incluye 02 exámenes básicos al escoger entre: colesterol, glucosa o triglicéridos), al cual podrá acceder comunicándose al  teléfono  Lima y provincias: (01) 415-1515"]
[]
[]
["ASISTENCIAS DE SERVICIOS PARA EL NEGOCIO"]
[]
["Servicios de emergencia de cerrajería, gasfitería, electricidad o vidriería atendidos por  técnicos especializados disponible  las 24 horas del día, todo el año, hasta un máximo de 4 eventos al año por cada servicio y hasta S/300 por evento."]
[]
["Servicio de orientación telefónica para referencia y coordinación del servicio de fumigaciones y mantenimiento en general, sin limite"]
[]
["ASISTENCIA LEGAL Y TRIBUTARIA PARA EL NEGOCIO"]
[]
["Asistencia Legal en caso de Robo del Negocio, disponible las 24 horas del día y  hasta 2 eventos al año."]
["Asistencia Tributaria Vía Telefónica, disponible las 24 horas del día ,  sin limite."]
["Asesoría telefónica en cuanto a materia Tributaria, Legal, Penal y Familiar, sin limite."]
["Asesoría telefónica en temas referentes a Permisos, Trámites y Licencias, disponible las 24 horas del día, sin límite."]
[]
["CONDICIONES APLICABLES A TODAS LAS SECCIONES"]
[]
["Monto Indemnizable: Para efectos de este seguro se entenderá como el monto total de la pérdida amparada por la póliza antes de aplicar el deducible."]
[]
["La Suma Asegurada de cada una de las Secciones adicionales a INCENDIO forman parte integrante de la Suma Asegurada de Incendio, se comportan como sub límite a Primera Perdida."]
[]
[]
["GARANTIAS APLICABLES A TODA LA PÓLIZA"]
[]
["En caso de incumplimiento EL CONTRATANTE y/o ASEGURADO perderán Todo derecho indemnizatorio proveniente de esta Póliza, a partir del momento mismo de la violación quedando En consecuencia liberada LA COMPAÑÍA de toda responsabilidad."]
[]
[]
["CONDICIONES APLICABLES A LA COTIZACIÓN"]
[]
["Se deja constancia expresa que la presente cotización se originó con información brindada por el ASEGURADO y/o CONTRATANTE, así como la no existencia de siniestros conocidos, ocurridos, ni reportados."]
[]
["Las condiciones antes detalladas quedan sujetas al no aumento de la siniestralidad antes del inicio de la vigencia."]
["La presente cotización se ha basado en la información presentada por el cliente, en caso de sufrir modificaciones para la orden de emisión, Pacifico se reserva el derecho de anular, cambiar o ajustar las condiciones y términos presentados."]
[]
["La presente cotización tiene una validez de quince (15) días calendarios, contados a partir de la fecha de presentación por parte de Pacífico."]
[]
["La presente cotización tiene una validez de 15 días"]
[]
["La Compañía, se obliga a entregar la póliza de seguro al contratante y/o asegurado dentro de 15 días calendario de haber recibido la solicitud si no media rechazo previo de ésta. En el supuesto que el contratante y/o asegurado no completen la información y/o no cumplan con las medidas que la compañía requiera, se considerará rechazada la solicitud al vencimiento del plazo indicado. El contratante y/o asegurado podrá presentar una nueva solicitud."]
[]
[]
[]
[]
[]
[]
[]
["PROTECCIÓN PARA NEGOCIO"]
[]
[]
[]
["La COMPAÑÍA informará al Contratante, dentro de los quince (15) días de recibida esta Solicitud, si la misma ha sido rechazada, salvo que se le haya requerido información adicional, necesaria para la evaluación del riesgo, en el referido plazo. En este caso, el plazo para comunicar el rechazo, se contará a partir de la recepción de la información completa solicitada."]
[]
[]
[]
[]
[]
["ACCIDENTES PERSONALES"]
[]
[]
["DATOS GENERALES"]
[]
[null,null,null,"Fecha de la cotización:",{"$f":"TODAY()","v":"2023-03-21"}]
[]
[null,null,null,"Producto:","ACCO"]
[null,null,null,"Plan:","Colectivo"]
[null,null,null,"Moneda:","Dólares"]
[]
[null,null,null,"Vigencia de la Póliza:","12 meses"]
[]
[null,null,null,null,"Local 1","Local 2","Local 3"]
[null,null,null,"Número de asegurados: ",10,5,15]
[null,null,null," (max 20 por Local)"]
[]
[null,null,null,"RUC Contratante",{"$f":"IF(LEN(#REF!)=0,\"\",#REF!)","v":{"$error":"#REF!"}}]
[null,null,null,"Nombre Contratante",{"$f":"IF(LEN(#REF!)=0,\"\",#REF!)","v":{"$error":"#REF!"}}]
[null,null,null,"Broker:",{"$f":"IF(LEN(#REF!)=0,\"\",#REF!)","v":{"$error":"#REF!"}}]
[]
[null,null,null,null,"Local 1"]
[null,null,null,"Actividad:",{"$f":"IF(LEN(Cotizador!$D$54)=0,\"\",Cotizador!$D$54)","v":""}]
[]
[null,null,null,null,"Local 2"]
[null,null,null,"Actividad:",{"$f":"IF(LEN(Cotizador!$D$56)=0,\"\",Cotizador!$D$56)","v":""}]
[]
[null,null,null,null,"Local 3"]
[null,null,null,"Actividad:",{"$f":"IF(LEN(Cotizador!$D$58)=0,\"\",Cotizador!$D$58)","v":""}]
[]
["COBERTURAS (*)"]
[]
[null,null,null,"Moneda:",null,{"$f":"E521","v":"Dólares"}]
[]
[null,null,null,null,"Local 1","Local 2","Local 3"]
[null,null,"Muerte Accidental:","Muerte Accidental:",10000,10000,15000]
[null,null,"Invalidez Permanente:","Invalidez Permanente:",{"$f":"IF(E547=5000,5000,IF(E547=10000,10000,IF(E547=15000,15000,0)))","v":10000},{"$f":"IF(F547=5000,5000,IF(F547=10000,10000,IF(F547=15000,15000,0)))","v":10000},{"$f":"IF(G547=5000,5000,IF(G547=10000,10000,IF(G547=15000,15000,0)))","v":15000}]
[null,null,"Gastos de Curación:","Gastos de Curación:",1500,1500,1500]
[null,null,"Gastos de Sepelio:","Gastos de Sepelio:",1000,1000,1000]
[null,null,null,"Transporte por Evacuación:","Transporte por Evacuación:"]
[null,null,null,"Traslado de Restos:","Traslado de Restos:"]
[]
[]
["CLÁUSULAS ADICIONALES"]
[null,null,"Cláusula de invalidez permanente parcial previa al seguro."]
[null,null,"Cláusula por la cobertura de Terrorismo y otros riesgos. "]
[null,null,"Cláusula por la práctica no profesional de deportes y/o actividades de riesgo."]
[null,null,"Cláusula por la conducción urbana o rural de motocicletas, motonetas y otros vehículos similares."]
[null,null,"Cláusula para pasajeros que usan cualquier medio habitual de transporte público de personas, en vehículos que no recorren itinerarios regulares y fijos. "]
[null,null,"Cláusula para pasajeros de aviones y/o helicópteros particulares y/o de la FAP por viajes eventuales. "]
[null,null,"Cláusula de ampliación del límite máximo de edad, personas mayores de 70 y hasta los 80 años inclusive."]
[]
[null,null,"RECARGOS"]
[null,null,"Por usar y/o portar armas"]
[]
[null,null,"DESCUENTOS"]
[null,null,"Por limitación a horas de trabajo."]
[null,null,"Por cubrir gastos no reembolsables por ESSALUD."]
[null,null,"Por aplicación de franquicia en incapacidad temporal.",null,null,null,"30 días"]
[null,null,"Por aplicación de deducible en gastos de curación.",null,null,null,0.25]
[null,null,null,null,"Local 1","Local 2","Local 3",null,"Total"]
[null,null,null,"Prima Neta Total.",{"$f":"E575*E526","v":75},{"$f":"F575*F526","v":37.5},{"$f":"G575*G526","v":150},null,{"$f":"SUM(E573:G573)","v":262.5}]
[null,null,null,"Prima Total (incluye IGV y DE):",{"$f":"E573*1.2154","v":91.155000000000001},{"$f":"F573*1.2154","v":45.577500000000001},{"$f":"G573*1.2154","v":182.31},null,{"$f":"SUM(E574:G574)","v":319.04250000000002}]
[null,null,null,"Prima neta por Persona:",{"$f":"IF(E547=5000,5,IF(E547=10000,7.5,IF(E547=15000,10,0)))","v":7.5},{"$f":"IF(F547=5000,5,IF(F547=10000,7.5,IF(F547=15000,10,0)))","v":7.5},{"$f":"IF(G547=5000,5,IF(G547=10000,7.5,IF(G547=15000,10,0)))","v":10},null,{"$f":"SUM(E575:G575)","v":25}]
[null,null,null,"Prima Total por Persona",{"$f":"E575*1.2154","v":9.1155000000000008},{"$f":"F575*1.2154","v":9.1155000000000008},{"$f":"G575*1.2154","v":12.154},null,{"$f":"SUM(E576:G576)","v":30.385000000000002}]
[]
[null,null,"TABLA DE PRIMAS"]
[]
[null,null,"Dias de Seguro",null,"Prima Neta",null,"Meses de Seguro",null,"Prima Neta"]
[null,null,1,0.05,{"$f":"D581*E575","v":0.375},null,2,0.3,{"$f":"H581*E575","v":2.25}]
[null,null,2,7.0000000000000007E-2,{"$f":"D582*E575","v":0.52500000000000002},null,3,0.4,{"$f":"H582*E575","v":3}]
[null,null,3,0.09,{"$f":"D583*E575","v":0.67499999999999993},null,4,0.5,{"$f":"H583*E575","v":3.75}]
[null,null,4,0.11,{"$f":"D584*E575","v":0.82499999999999996},null,5,0.6,{"$f":"H584*E575","v":4.5}]
[null,null,5,0.13,{"$f":"D585*E575","v":0.97500000000000009},null,6,0.7,{"$f":"H585*E575","v":5.25}]
[null,null,6,0.14000000000000001,{"$f":"D586*E575","v":1.05},null,7,0.8,{"$f":"H586*E575","v":6}]
[null,null,7,0.15,{"$f":"D587*E575","v":1.125},null,8,0.9,{"$f":"H587*E575","v":6.75}]
[null,null,"8 a 15",0.2,{"$f":"D588*E575","v":1.5},null,"más de 9",1,{"$f":"H588*E575","v":7.5}]
[null,null,"16 a 30",0.25,{"$f":"D589*E575","v":1.875}]
[]
["COMENTARIOS"]
["Ingresa aquí tu comentario"]
[]
[]
[]
["SLIP DE COTIZACIÓN PARA EL SEGURO DE CARGA"]
["TRANSPORTE NACIONAL"]
["(TRANSPORTISTAS TERRESTRE)"]
[]
[]
[]
[null,"CONTRATANTE: ",null,{"$f":"IF(LEN(CuestionarioTransporte!$C$5)>0,CuestionarioTransporte!$C$5,\"\")","v":{"$error":"#REF!"}}]
[]
[null,"RUC: ",null,{"$f":"IF(LEN(CuestionarioTransporte!$C$6)>0,CuestionarioTransporte!$C$6,\"\")","v":{"$error":"#REF!"}}]
[]
[null,"ASEGURADO",null,{"$f":"IF(LEN(CuestionarioTransporte!$C$9)>0,CuestionarioTransporte!$C$9,\"\")","v":{"$error":"#REF!"}}]
[null,"Propietario de la mercadería"]
[]
["RADIO DE ACCION "]
["Dentro del Territorio Nacional; excluyendo el tránsito previo de la exportación y el transito posterior de importación, así como el transporte fluvial."]
[]
["MEDIOS DE TRANSPORTE "]
["En vehículos de carga de propiedad del Asegurado y/o de terceros que cuenten con autorización vigente otorgada por las Autoridades competentes para prestar el servicio de transporte terrestre automotor de carga y que se encuentren inscritos en los registros de la Dirección de Transporte Terrestre del Ministerio de Transporte y Comunicaciones. "]
[]
["DESCRIPCION DE LA MERCANCIA:"]
["Mercadería de terceros bajo su responsabilidad, custodia o control, excluyendo: "]
[]
["1. Animales vivos"]
["2. Explosivos y productos químicos de naturaleza explosiva o autocombustible y productos fiscalizados."]
["3. Fosforo (cerillas), fulminantes comunes y eléctricos"]
["4. Armas y Municiones"]
["5. Joyas, documentos valorados, valores, obras de arte, pieles, dinero o cualquier papel que lo represente, piedras preciosas y relojes,"]
["6. Menaje de casa y/o equipaje acompañado y/o efectos personales."]
["7. Equipos de cómputo, sus partes y piezas, software no instalado."]
["8. Tarjetas telefónicas, tablets, similares y sus partes y piezas"]
["9. Equipos de telefonía móvil (celulares, smartphones, iphones, modems)"]
["10. CDs, DVDs, Blurays, videojuegos y televisores."]
["11. Todo tipo de productos a granel (granos secos o líquidos)."]
["12. Concentrado de minerales tales como: oro y plata, "]
["13. Cátodos de Cobre, Cableado eléctrico"]
["14. Llantas con neumáticos / sin neumáticos,"]
["15. Productos farmacéuticos"]
["16. Licores, Cigarrillos "]
["17. Artículos para deportes "]
["18. Café en sacos y tipo exportación"]
[]
[]
["VALORIZACION DE LA MERCANCIA "]
[]
["Factura Comercial y/o Guía de Remisión excluyendo los Impuestos de Ley"]
[]
[]
["COBERTURAS "]
[]
[null,"CODIGO","CLAUSULAS"]
[null,107430,"990000 - CLAUSULAS GENERALES CONTRATACIÓN RIESGOS GENERALES"]
[null,107491,"111000 TRANSPORTES CARGA ABIERTA - CONDICIONES GENERALES"]
[null,107209,"CL TRA002 ACCIDENTE AL MEDIO DE TRANSPORTE  "]
[null,107212,"CL TRA012  DE ROBO POR ASALTO"]
[null,107215,"CL TRA013 DE TRANSITO"]
[null,107226,"066 CLAUSULA DE LOCALIDAD DEL INSTITUTO"]
[null,107228,"CL DE TERMINACION DEL TRANSITO (TERRORISMO) "]
[null,107217,"256 CL DEL INST PARA HUELGAS (CARGAMENTOS) "]
[null,107202,"356 CL DEL INST SOBRE EXCLUSION DE CONTAMINACION RADIOACTIVA"]
[null,107214,"CL TRA003  DE CARGA Y DESCARGA"]
[]
[]
["LIMITE MAXIMO DE RESPONSABILIDAD "]
[]
["HASTA US$50,000.00 Cincuenta mil  dólares americanos "]
[]
["Cualquier exceso en el límite indicado deberá ser puesto en conocimiento de la compañía de seguros para su aprobación antes del inicio del viaje. "]
[]
["Límite agregado anual por Robo: $50,000.00"]
[]
["MOVIMIENTO ESTIMADO ANUAL (MAE)"]
[]
["US$ 500,000.00 Quinientos mil dólares americanos (MINIMO) máximo $10,000,000.00"]
[]
["El Asegurado se compromete en proporcionar a la Compañía después de haber terminado la vigencia de esta Póliza, la suma total definitiva del período de seguro, en base a los libros contables. "]
[]
["CONDICIONES ESPECIALES"]
[]
["Queda entendido y convenido que las operaciones de transporte terrestre de mercadería deben realizarse considerando lo siguiente:"]
[]
["·         Que los transportes realizados por vehículos de terceros deben ser realizados bajo manifiestos / carta de porte (o nombre aplicable al documento) y/o guía de remisión emitida por el Asegurado y/o por el propietario de la mercadería."]
["·         Que los Conductores de los vehículos propios y de terceros son personas debidamente habilitadas y premunidas de una Licencia de conducir vigente y que corresponda a la clase y categoría prevista en el Reglamento de Licencias de Conducir para las características del vehículo que conduce. Los conductores deberán encontrarse identificados en el Registro de Nómina de Conductores del Registro Nacional de Transporte Terrestre del MTC."]
["·         Que los vehículos propios y de terceros a utilizar deberán ser cerrados, evitando que la mercadería se encuentre expuesta a simple vista, salvo aquella carga que por su propia naturaleza y/o dimensiones no pueda ser transportada en vehículos cerrados. "]
["·         Que los vehículos de carga propios y de terceros no deben ser estacionados en sitios o lugares en los cuales no exista iluminación. En caso se tenga que pernoctar por motivos debidamente justificados, la unidad deberá permanecer en un estacionamiento que sea autorizado por el Asegurado, que se encuentre dentro de la ruta establecida para el transporte y que garantice la seguridad de la mercadería a través de medidas de protección y vigilancia policial o privada. "]
["·         Que todos los transportes terrestres deben ser realizados en vehículos propios y de terceros que cuenten con un sistema de posicionamiento global (GPS) que brinde información en tiempo real y que se encuentre en funcionamiento mientras la mercadería se encuentre en el vehículo. Este sistema deberá brindar señales de alarma a un Centro de Control Terrestre en forma automática y a través de un dispositivo o botón de pánico; asimismo, deben contar con cobertura total dentro de las rutas establecidas para el transporte. El seguimiento de la situación de los vehículos durante el servicio debe ser continuo y permanente las 24 horas del día y se debe contar con un plan de contingencias y sistema de respuesta rápida ante ocurrencias, asaltos y/o situaciones de emergencia."]
["·         Que los Conductores deben utilizar medios alternos de comunicación, tales como equipos de radio y/o teléfonos celulares y mantener comunicación permanente con los centros de control durante el traslado de la mercancía."]
["·         Que las unidades transportadoras no deben llevar publicidad o propaganda que indique que están transportando."]
["·         Que los Conductores de vehículos propios y de terceros no deberán realizar jornadas de conducción continúas de más de cinco (05) horas para el servicio diurno o más de cuatro (04) horas en el servicio nocturno. Tras alcanzar el periodo máximo de conducción continua, el Conductor hará una pausa ininterrumpida de por lo menos 45 minutos. La duración acumulada de jornadas de conducción no deberá exceder de diez (10) horas en un periodo de veinte y cuatro (24) horas, contadas desde la hora de inicio de la conducción en un servicio."]
[]
["La inobservancia de estas Condiciones Especiales liberará de toda responsabilidad indemnizatoria a la Compañía de Seguros. "]
[]
["EXCLUSIONES"]
[]
["a)    Actos de deshonestidad cometidos por los empleados del Asegurado cuando la mercancía sea transportada en vehículos de propiedad del Asegurado y/o de terceros bajo su responsabilidad. "]
["b)    Olvido y/o negligencia y/o embriaguez de los empleados y/o personas encargadas del transporte y custodia de acuerdo a la Ley, cuando la mercancía sea transportada en vehículos de propiedad el Asegurado y/o de terceros bajo su responsabilidad. "]
["c)    Robo por escape, ratería, hurto, estafa, engaño, sustracciones sistemáticas, fraude o desaparición, cuando la mercancía sea transportada en vehículos de propiedad del Asegurado y/o de terceros bajo su responsabilidad. "]
["d)    Robo por desaparición mientras los objetos asegurados o el medio transportador se encuentre dentro de algún local o recinto del Asegurado o de terceros, en calidad de depositarios y no como parte del tránsito ordinario. "]
["e)    Pérdidas y/o daños causados a la mercancía asegurada como consecuencia de choques contra puentes y/o túneles durante su traslado terrestre, hasta su destino final."]
["f)     El contratante de la póliza podrá contratar a todos los transportistas que cumplan con las condiciones de la póliza; los Transportistas contratados no podrán subcontratar a otros transportistas"]
[]
["REAJUSTE DE PRIMAS "]
["La Compañía se reserva el derecho de efectuar revisiones de la Póliza y reajustar las Tasas y deducibles de acuerdo al índice de siniestralidad que presente la Póliza, previo acuerdo con el Asegurado y/o Broker de seguros. "]
[]
[null,"DEDUCIBLES"]
[null,"Para robo por asalto:",null,"20% del monto indemnizable, mínimo US$ 500"]
[null,"Para otros riesgos: ",null,"10% del monto indemnizable, mínimo US$ 200"]
[]
[]
[null,"ESQUEMA DE PRIMAS NETAS"]
[]
[null,"·         Prima neta anual USD:",null,null,{"$f":"CuestionarioTransporte!$D$26","v":345}]
[]
[]
["Cordialmente,"]
[]
[{"$f":"+TODAY()","v":"2023-03-21"}]

{"sheet":"DatosdelNegocioLocal1","index":24,"n_rows":36,"n_cols":34,"rows_kept":36,"cut":false,"hidden":false,"merged":[[15,8,15,14],[1,8,2,12],[11,8,11,9],[7,8,7,12]]}
[]
[]
[]
[]
[null,null,null,null,null,null,null,null,null,null,null,null,null,null,null,null,null,null,null,null,null,null,null,null,null,null,null,null,"TIPO","CATEG",null,null,"Comercial",{"$f":"IF(ISERROR(VLOOKUP(I8,$AC$6:$AE$36,2,0)),\"\",(VLOOKUP(I8,$AC$6:$AE$36,2,0)))","v":""}]
[null,null,null,null,null,null,"Actividad Realizada",null,null,null,null,null,null,null,null,null,null,null,null,null,null,null,null,null,null,null,null,1,"AGENCIAS DE EMPLEO","C",{"$f":"+AB6","v":1},null,"Servicios",{"$f":"IF(ISERROR(VLOOKUP(I8,$AC$6:$AE$36,3,0)),\"\",VLOOKUP(I8,$AC$6:$AE$36,3,0))","v":""}]
[null,null,null,null,null,null,null,null,null,null,null,null,null,null,null,null,null,null,null,null,null,null,null,null,null,null,null,2,"AGENCIAS DE PUBLICIDAD Y MARKETING","C",{"$f":"+AB7","v":2},null,"Comercial y Servicios"]
[null,null,null,null,null,null,null,"Actividad y/o Giro:",{"$f":"IF(Cotizador!$D$54=0,\"\",Cotizador!$D$54)","v":""},null,null,null,null,null,null,null,null,null,null,null,null,null,null,null,null,null,null,3,"BAZARES","B",3,null,{"$f":"IF(LEN(I8)>0,1,0)+IF(LEN(I16)>0,1,0)+IF(LEN(I12)>0,1,0)","v":1}]
[null,null,null,null,null,null,null,null,null,null,null,null,null,null,null,null,null,null,null,null,null,null,null,null,null,null,null,4,"BODEGAS / MINIMARKETS","A",4]
[null,null,null,null,null,null,"Tipo de Negocio",null,null,null,null,null,null,null,null,null,null,null,null,null,null,null,null,null,null,null,null,5,"CARNICERÍAS","A",5]
[null,null,null,null,null,null,null,null,null,null,null,null,null,null,null,null,null,null,null,null,null,null,null,null,null,null,null,6,"CLUBES, CENTROS DE ESPARCIMIENTO, CENTROS DEPORTIVOS.","C",6]
[null,null,null,null,null,null,null,"Tipo:",{"$f":"IF(Cotizador!$D$62=0,\"\",Cotizador!$D$62)","v":"Comercial y Servicios"},null,null,null,null,null,null,null,null,null,null,null,null,null,null,null,null,null,null,7,"COLEGIOS, ACADEMIAS, INSTITUTOS, CENTROS DE ENSEÑANZA.","C",7]
[null,null,null,null,null,null,null,null,null,null,null,null,null,null,null,null,null,null,null,null,null,null,null,null,null,null,null,8,"CONSULTORIOS MÉDICOS","B",8]
[null,null,null,null,null,null,"Uso del Local",null,null,null,null,null,null,null,null,null,null,null,null,null,null,null,null,null,null,null,null,10,"FERRETERÍAS","B",10]
[null,null,null,null,null,null,null,null,null,null,null,null,null,null,null,null,null,null,null,null,null,null,null,null,null,null,null,11,"GIMNASIOS","C",11]
[null,null,null,null,null,null,null,"Ocupación:",{"$f":"IF(Cotizador!$D$71=0,\"\",Cotizador!$D$71)","v":""},null,null,null,null,null,null,null,null,null,null,null,null,null,null,null,null,null,null,12,"HELADERÍAS (SÓLO VENTA)","A",12]
[null,null,null,null,null,null,null,null,null,null,null,null,null,null,null,null,null,null,null,null,null,null,null,null,null,null,null,13,"HOTELES Y HOSPEDAJES (DE 2 Y 3 ESTRELLAS)","A",13]
[null,null,null,null,null,null,null,null,null,null,null,null,null,null,null,null,null,null,null,null,null,null,null,null,null,null,null,14,"INSTITUCIONES RELIGIOSAS","C",14]
[null,null,null,null,null,null,null,null,null,null,null,null,null,null,null,null,null,null,null,null,null,null,null,null,null,null,null,15,"LAVANDERIAS","B",15]
[null,null,null,null,null,null,null,null,null,null,null,null,null,null,null,null,null,null,null,null,null,null,null,null,null,null,null,16,"LIBRERÍAS","B",16]
[null,null,null,null,null,null,null,null,null,null,null,null,null,null,null,null,null,null,null,null,null,null,null,null,null,null,null,17,"OFICINAS EN GENERAL","C",17]
[null,null,null,null,null,null,null,null,null,null,null,null,null,null,null,null,null,null,null,null,null,null,null,null,null,null,null,18,"ÓPTICAS","B",18]
[null,null,null,null,null,null,null,null,null,null,null,null,null,null,null,null,null,null,null,null,null,null,null,null,null,null,null,19,"PANADERÍAS Y PASTELERÍAS","A",19]
[null,null,null,null,null,null,null,null,null,null,null,null,null,null,null,null,null,null,null,null,null,null,null,null,null,null,null,20,"PELUQUERÍAS","C",20]
[null,null,null,null,null,null,null,null,null,null,null,null,null,null,null,null,null,null,null,null,null,null,null,null,null,null,null,21,"RESTAURANTES / NEGOCIOS DE COMIDA","A",21]
[null,null,null,null,null,null,null,null,null,null,null,null,null,null,null,null,null,null,null,null,null,null,null,null,null,null,null,22,"SALONES DE BELLEZA /SPA","C",22]
[null,null,null,null,null,null,null,null,null,null,null,null,null,null,null,null,null,null,null,null,null,null,null,null,null,null,null,23,"SERVICIOS FUNERARIOS","C",23]
[null,null,null,null,null,null,null,null,null,null,null,null,null,null,null,null,null,null,null,null,null,null,null,null,null,null,null,24,"TALLERES DE METAL MECÁNICA","B",24]
[null,null,null,null,null,null,null,null,null,null,null,null,null,null,null,null,null,null,null,null,null,null,null,null,null,null,null,25,"VENTA DE MAQUINARIA PESADA","B",25]
[null,null,null,null,null,null,null,null,null,null,null,null,null,null,null,null,null,null,null,null,null,null,null,null,null,null,null,26,"VENTA ARTÍCULOS DE LIMPIEZA PARA EL HOGAR","B",26]
[null,null,null,null,null,null,null,null,null,null,null,null,null,null,null,null,null,null,null,null,null,null,null,null,null,null,null,27,"VENTA DE ACCESORIOS (EXCEPTO JOYAS, PIEDRAS PRECIOSAS, CELULARES Y COMPUTADORAS)","B",27]
[null,null,null,null,null,null,null,null,null,null,null,null,null,null,null,null,null,null,null,null,null,null,null,null,null,null,null,28,"VENTA DE ROPA Y VENTA DE TEXTILES (NO FÁBRICA)","B",28]
[null,null,null,null,null,null,null,null,null,null,null,null,null,null,null,null,null,null,null,null,null,null,null,null,null,null,null,29,"VENTA DE VÍVERES EN GENERAL","B",29]
[null,null,null,null,null,null,null,null,null,null,null,null,null,null,null,null,null,null,null,null,null,null,null,null,null,null,null,30,"VETERINARIAS","C",30]
[null,null,null,null,null,null,null,null,null,null,null,null,null,null,null,null,null,null,null,null,null,null,null,null,null,null,null,31,"ZAPATERÍAS (SOLO VENTA)","B",31]
[null,null,null,null,null,null,null,null,null,null,null,null,null,null,null,null,null,null,null,null,null,null,null,null,null,null,null,32,"OTROS","C",1]

{"sheet":"DatosdelNegocioLocal2","index":25,"n_rows":36,"n_cols":34,"rows_kept":36,"cut":false,"hidden":false,"merged":[[1,8,2,12],[7,8,7,12],[11,8,11,9],[15,8,15,14]]}
[]
[]
[]
[]
[null,null,null,null,null,null,null,null,null,null,null,null,null,null,null,null,null,null,null,null,null,null,null,null,null,null,null,null,"TIPO","CATEG",null,null,"Comercial",{"$f":"IF(ISERROR(VLOOKUP(I8,$AC$6:$AE$36,2,0)),\"\",(VLOOKUP(I8,$AC$6:$AE$36,2,0)))","v":""}]
[null,null,null,null,null,null,"Actividad Realizada",null,null,null,null,null,null,null,null,null,null,null,null,null,null,null,null,null,null,null,null,1,"AGENCIAS DE EMPLEO","C",{"$f":"+AB6","v":1},null,"Servicios",{"$f":"IF(ISERROR(VLOOKUP(I8,$AC$6:$AE$36,3,0)),\"\",VLOOKUP(I8,$AC$6:$AE$36,3,0))","v":""}]
[null,null,null,null,null,null,null,null,null,null,null,null,null,null,null,null,null,null,null,null,null,null,null,null,null,null,null,2,"AGENCIAS DE PUBLICIDAD Y MARKETING","C",{"$f":"+AB7","v":2},null,"Comercial y Servicios"]
[null,null,null,null,null,null,null,"Actividad y/o Giro:",{"$f":"IF(Cotizador!$D$56=0,\"\",Cotizador!$D$56)","v":""},null,null,null,null,null,null,null,null,null,null,null,null,null,null,null,null,null,null,3,"BAZARES","B",3,null,{"$f":"IF(LEN(I8)>0,1,0)+IF(LEN(I16)>0,1,0)+IF(LEN(I12)>0,1,0)","v":1}]
[null,null,null,null,null,null,null,null,null,null,null,null,null,null,null,null,null,null,null,null,null,null,null,null,null,null,null,4,"BODEGAS / MINIMARKETS","A",4]
[null,null,null,null,null,null,"Tipo de Negocio",null,null,null,null,null,null,null,null,null,null,null,null,null,null,null,null,null,null,null,null,5,"CARNICERÍAS","A",5]
[null,null,null,null,null,null,null,null,null,null,null,null,null,null,null,null,null,null,null,null,null,null,null,null,null,null,null,6,"CLUBES, CENTROS DE ESPARCIMIENTO, CENTROS DEPORTIVOS.","C",6]
[null,null,null,null,null,null,null,"Tipo:",{"$f":"IF(Cotizador!$D$64=0,\"\",Cotizador!$D$64)","v":"Comercial y Servicios"},null,null,null,null,null,null,null,null,null,null,null,null,null,null,null,null,null,null,7,"COLEGIOS, ACADEMIAS, INSTITUTOS, CENTROS DE ENSEÑANZA.","C",7]
[null,null,null,null,null,null,null,null,null,null,null,null,null,null,null,null,null,null,null,null,null,null,null,null,null,null,null,8,"CONSULTORIOS MÉDICOS","B",8]
[null,null,null,null,null,null,"Uso del Local",null,null,null,null,null,null,null,null,null,null,null,null,null,null,null,null,null,null,null,null,10,"FERRETERÍAS","B",10]
[null,null,null,null,null,null,null,null,null,null,null,null,null,null,null,null,null,null,null,null,null,null,null,null,null,null,null,11,"GIMNASIOS","C",11]
[null,null,null,null,null,null,null,"Ocupación:",{"$f":"IF(Cotizador!$D$73=0,\"\",Cotizador!$D$73)","v":""},null,null,null,null,null,null,null,null,null,null,null,null,null,null,null,null,null,null,12,"HELADERÍAS (SÓLO VENTA)","A",12]
[null,null,null,null,null,null,null,null,null,null,null,null,null,null,null,null,null,null,null,null,null,null,null,null,null,null,null,13,"HOTELES Y HOSPEDAJES (DE 2 Y 3 ESTRELLAS)","A",13]
[null,null,null,null,null,null,null,null,null,null,null,null,null,null,null,null,null,null,null,null,null,null,null,null,null,null,null,14,"INSTITUCIONES RELIGIOSAS","C",14]
[null,null,null,null,null,null,null,null,null,null,null,null,null,null,null,null,null,null,null,null,null,null,null,null,null,null,null,15,"LAVANDERIAS","B",15]
[null,null,null,null,null,null,null,null,null,null,null,null,null,null,null,null,null,null,null,null,null,null,null,null,null,null,null,16,"LIBRERÍAS","B",16]
[null,null,null,null,null,null,null,null,null,null,null,null,null,null,null,null,null,null,null,null,null,null,null,null,null,null,null,17,"OFICINAS EN GENERAL","C",17]
[null,null,null,null,null,null,null,null,null,null,null,null,null,null,null,null,null,null,null,null,null,null,null,null,null,null,null,18,"ÓPTICAS","B",18]
[null,null,null,null,null,null,null,null,null,null,null,null,null,null,null,null,null,null,null,null,null,null,null,null,null,null,null,19,"PANADERÍAS Y PASTELERÍAS","A",19]
[null,null,null,null,null,null,null,null,null,null,null,null,null,null,null,null,null,null,null,null,null,null,null,null,null,null,null,20,"PELUQUERÍAS","C",20]
[null,null,null,null,null,null,null,null,null,null,null,null,null,null,null,null,null,null,null,null,null,null,null,null,null,null,null,21,"RESTAURANTES / NEGOCIOS DE COMIDA","A",21]
[null,null,null,null,null,null,null,null,null,null,null,null,null,null,null,null,null,null,null,null,null,null,null,null,null,null,null,22,"SALONES DE BELLEZA /SPA","C",22]
[null,null,null,null,null,null,null,null,null,null,null,null,null,null,null,null,null,null,null,null,null,null,null,null,null,null,null,23,"SERVICIOS FUNERARIOS","C",23]
[null,null,null,null,null,null,null,null,null,null,null,null,null,null,null,null,null,null,null,null,null,null,null,null,null,null,null,24,"TALLERES DE METAL MECÁNICA","B",24]
[null,null,null,null,null,null,null,null,null,null,null,null,null,null,null,null,null,null,null,null,null,null,null,null,null,null,null,25,"VENTA DE MAQUINARIA PESADA","B",25]
[null,null,null,null,null,null,null,null,null,null,null,null,null,null,null,null,null,null,null,null,null,null,null,null,null,null,null,26,"VENTA ARTÍCULOS DE LIMPIEZA PARA EL HOGAR","B",26]
[null,null,null,null,null,null,null,null,null,null,null,null,null,null,null,null,null,null,null,null,null,null,null,null,null,null,null,27,"VENTA DE ACCESORIOS (EXCEPTO JOYAS, PIEDRAS PRECIOSAS, CELULARES Y COMPUTADORAS)","B",27]
[null,null,null,null,null,null,null,null,null,null,null,null,null,null,null,null,null,null,null,null,null,null,null,null,null,null,null,28,"VENTA DE ROPA Y VENTA DE TEXTILES (NO FÁBRICA)","B",28]
[null,null,null,null,null,null,null,null,null,null,null,null,null,null,null,null,null,null,null,null,null,null,null,null,null,null,null,29,"VENTA DE VÍVERES EN GENERAL","B",29]
[null,null,null,null,null,null,null,null,null,null,null,null,null,null,null,null,null,null,null,null,null,null,null,null,null,null,null,30,"VETERINARIAS","C",30]
[null,null,null,null,null,null,null,null,null,null,null,null,null,null,null,null,null,null,null,null,null,null,null,null,null,null,null,31,"ZAPATERÍAS (SOLO VENTA)","B",31]
[null,null,null,null,null,null,null,null,null,null,null,null,null,null,null,null,null,null,null,null,null,null,null,null,null,null,null,32,"OTROS","C",1]

{"sheet":"DatosdelNegocioLocal3","index":26,"n_rows":36,"n_cols":34,"rows_kept":36,"cut":false,"hidden":false,"merged":[[1,8,2,12],[7,8,7,12],[11,8,11,9],[15,8,15,14]]}
[]
[]
[]
[]
[null,null,null,null,null,null,null,null,null,null,null,null,null,null,null,null,null,null,null,null,null,null,null,null,null,null,null,null,"TIPO","CATEG",null,null,"Comercial",{"$f":"IF(ISERROR(VLOOKUP(I8,$AC$6:$AE$36,2,0)),\"\",(VLOOKUP(I8,$AC$6:$AE$36,2,0)))","v":""}]
[null,null,null,null,null,null,"Actividad Realizada",null,null,null,null,null,null,null,null,null,null,null,null,null,null,null,null,null,null,null,null,1,"AGENCIAS DE EMPLEO","C",{"$f":"+AB6","v":1},null,"Servicios",{"$f":"IF(ISERROR(VLOOKUP(I8,$AC$6:$AE$36,3,0)),\"\",VLOOKUP(I8,$AC$6:$AE$36,3,0))","v":""}]
[null,null,null,null,null,null,null,null,null,null,null,null,null,null,null,null,null,null,null,null,null,null,null,null,null,null,null,2,"AGENCIAS DE PUBLICIDAD Y MARKETING","C",{"$f":"+AB7","v":2},null,"Comercial y Servicios"]
[null,null,null,null,null,null,null,"Actividad y/o Giro:",{"$f":"IF(Cotizador!$D$58=0,\"\",Cotizador!$D$58)","v":""},null,null,null,null,null,null,null,null,null,null,null,null,null,null,null,null,null,null,3,"BAZARES","B",3,null,{"$f":"IF(LEN(I8)>0,1,0)+IF(LEN(I16)>0,1,0)+IF(LEN(I12)>0,1,0)","v":1}]
[null,null,null,null,null,null,null,null,null,null,null,null,null,null,null,null,null,null,null,null,null,null,null,null,null,null,null,4,"BODEGAS / MINIMARKETS","A",4]
[null,null,null,null,null,null,"Tipo de Negocio",null,null,null,null,null,null,null,null,null,null,null,null,null,null,null,null,null,null,null,null,5,"CARNICERÍAS","A",5]
[null,null,null,null,null,null,null,null,null,null,null,null,null,null,null,null,null,null,null,null,null,null,null,null,null,null,null,6,"CLUBES, CENTROS DE ESPARCIMIENTO, CENTROS DEPORTIVOS.","C",6]
[null,null,null,null,null,null,null,"Tipo:",{"$f":"IF(Cotizador!$D$66=0,\"\",Cotizador!$D$66)","v":"Comercial y Servicios"},null,null,null,null,null,null,null,null,null,null,null,null,null,null,null,null,null,null,7,"COLEGIOS, ACADEMIAS, INSTITUTOS, CENTROS DE ENSEÑANZA.","C",7]
[null,null,null,null,null,null,null,null,null,null,null,null,null,null,null,null,null,null,null,null,null,null,null,null,null,null,null,8,"CONSULTORIOS MÉDICOS","B",8]
[null,null,null,null,null,null,"Uso del Local",null,null,null,null,null,null,null,null,null,null,null,null,null,null,null,null,null,null,null,null,10,"FERRETERÍAS","B",10]
[null,null,null,null,null,null,null,null,null,null,null,null,null,null,null,null,null,null,null,null,null,null,null,null,null,null,null,11,"GIMNASIOS","C",11]
[null,null,null,null,null,null,null,"Ocupación:",{"$f":"IF(Cotizador!$D$75=0,\"\",Cotizador!$D$75)","v":""},null,null,null,null,null,null,null,null,null,null,null,null,null,null,null,null,null,null,12,"HELADERÍAS (SÓLO VENTA)","A",12]
[null,null,null,null,null,null,null,null,null,null,null,null,null,null,null,null,null,null,null,null,null,null,null,null,null,null,null,13,"HOTELES Y HOSPEDAJES (DE 2 Y 3 ESTRELLAS)","A",13]
[null,null,null,null,null,null,null,null,null,null,null,null,null,null,null,null,null,null,null,null,null,null,null,null,null,null,null,14,"INSTITUCIONES RELIGIOSAS","C",14]
[null,null,null,null,null,null,null,null,null,null,null,null,null,null,null,null,null,null,null,null,null,null,null,null,null,null,null,15,"LAVANDERIAS","B",15]
[null,null,null,null,null,null,null,null,null,null,null,null,null,null,null,null,null,null,null,null,null,null,null,null,null,null,null,16,"LIBRERÍAS","B",16]
[null,null,null,null,null,null,null,null,null,null,null,null,null,null,null,null,null,null,null,null,null,null,null,null,null,null,null,17,"OFICINAS EN GENERAL","C",17]
[null,null,null,null,null,null,null,null,null,null,null,null,null,null,null,null,null,null,null,null,null,null,null,null,null,null,null,18,"ÓPTICAS","B",18]
[null,null,null,null,null,null,null,null,null,null,null,null,null,null,null,null,null,null,null,null,null,null,null,null,null,null,null,19,"PANADERÍAS Y PASTELERÍAS","A",19]
[null,null,null,null,null,null,null,null,null,null,null,null,null,null,null,null,null,null,null,null,null,null,null,null,null,null,null,20,"PELUQUERÍAS","C",20]
[null,null,null,null,null,null,null,null,null,null,null,null,null,null,null,null,null,null,null,null,null,null,null,null,null,null,null,21,"RESTAURANTES / NEGOCIOS DE COMIDA","A",21]
[null,null,null,null,null,null,null,null,null,null,null,null,null,null,null,null,null,null,null,null,null,null,null,null,null,null,null,22,"SALONES DE BELLEZA /SPA","C",22]
[null,null,null,null,null,null,null,null,null,null,null,null,null,null,null,null,null,null,null,null,null,null,null,null,null,null,null,23,"SERVICIOS FUNERARIOS","C",23]
[null,null,null,null,null,null,null,null,null,null,null,null,null,null,null,null,null,null,null,null,null,null,null,null,null,null,null,24,"TALLERES DE METAL MECÁNICA","B",24]
[null,null,null,null,null,null,null,null,null,null,null,null,null,null,null,null,null,null,null,null,null,null,null,null,null,null,null,25,"VENTA DE MAQUINARIA PESADA","B",25]
[null,null,null,null,null,null,null,null,null,null,null,null,null,null,null,null,null,null,null,null,null,null,null,null,null,null,null,26,"VENTA ARTÍCULOS DE LIMPIEZA PARA EL HOGAR","B",26]
[null,null,null,null,null,null,null,null,null,null,null,null,null,null,null,null,null,null,null,null,null,null,null,null,null,null,null,27,"VENTA DE ACCESORIOS (EXCEPTO JOYAS, PIEDRAS PRECIOSAS, CELULARES Y COMPUTADORAS)","B",27]
[null,null,null,null,null,null,null,null,null,null,null,null,null,null,null,null,null,null,null,null,null,null,null,null,null,null,null,28,"VENTA DE ROPA Y VENTA DE TEXTILES (NO FÁBRICA)","B",28]
[null,null,null,null,null,null,null,null,null,null,null,null,null,null,null,null,null,null,null,null,null,null,null,null,null,null,null,29,"VENTA DE VÍVERES EN GENERAL","B",29]
[null,null,null,null,null,null,null,null,null,null,null,null,null,null,null,null,null,null,null,null,null,null,null,null,null,null,null,30,"VETERINARIAS","C",30]
[null,null,null,null,null,null,null,null,null,null,null,null,null,null,null,null,null,null,null,null,null,null,null,null,null,null,null,31,"ZAPATERÍAS (SOLO VENTA)","B",31]
[null,null,null,null,null,null,null,null,null,null,null,null,null,null,null,null,null,null,null,null,null,null,null,null,null,null,null,32,"OTROS","C",1]